Player,Position,ProTeam,RotoTeam,RVid,MLBAMID,BDBID,RotoValue,pG,pIP,pH,pHR,pK,pBB,pIBB,pHB,pER,pWin,pL,pSav,pWHIP,pERA,pFIP,bG,bAB,bH,b2B,b3B,bHR,bRBOE,bR,bRBI,bSB,bCS,bBB,bIBB,bHBP,bSF,bSH,bAvg,bOBP,bSlg,bwOBA
Cody Bellinger,1B/CF/RF,Dodgers,,10872,641355,,$41.87,,,,,,,,,,,,,,,,156,558,170,34,3,47,4,121,115,15,5,95,21,3,4,,.305,.406,.629,.434
Freddie Freeman,1B,Braves,,1836,518692,freemfr01,$31.86,,,,,,,,,,,,,,,,158,597,176,34,2,38,2,113,121,6,3,87,11,6,2,,.295,.389,.549,.400
DJ LeMahieu,1B/2B/3B,Yankees,,2658,518934,lemahdj01,$29.75,,,,,,,,,,,,,,,,145,602,197,33,2,26,6,109,102,5,2,46,,2,4,1,.327,.374,.518,.395
Pete Alonso,1B,Mets,,12005,624413,,$27.04,,,,,,,,,,,,,,,,161,597,155,30,2,53,8,103,120,1,,72,6,21,3,,.260,.358,.583,.405
Josh Hader,RP,Brewers,,11246,623352,,$22.75,61,75.67,41,15,138,20,2,4,22,3,5,37,0.806,2.62,2.90,,,,,,,,,,,,,,,,,,,,
Trey Mancini,1B/LF/RF,Orioles,,9387,641820,,$21.72,,,,,,,,,,,,,,,,154,602,175,38,2,35,5,106,97,1,,63,3,9,5,,.291,.364,.535,.390
José Abreu,1B/DH,White Sox,,7346,547989,,$21.47,,,,,,,,,,,,,,,,159,634,180,38,1,33,7,85,123,2,2,36,4,13,10,,.284,.330,.503,.362
Yuli Gurriel,1B/3B,Astros,,11531,493329,,$20.58,,,,,,,,,,,,,,,,144,564,168,40,2,31,4,85,104,5,3,37,2,5,6,,.298,.343,.541,.380
Carlos Santana,1B/DH,Indians,,1047,467793,santaca01,$20.56,,,,,,,,,,,,,,,,158,573,161,30,1,34,4,110,93,4,,108,12,3,2,,.281,.397,.515,.397
Josh Bell,1B,Pirates,,6324,605137,,$20.26,,,,,,,,,,,,,,,,143,527,146,37,3,37,2,94,116,,1,74,13,5,7,,.277,.367,.569,.391
Kirby Yates,RP,Padres,,6219,489446,,$19.09,60,60.67,41,2,101,13,1,7,8,,5,41,0.890,1.19,1.14,,,,,,,,,,,,,,,,,,,,
Danny Santana,1B/CF,Rangers,,5347,542454,,$18.77,,,,,,,,,,,,,,,,130,474,134,23,6,28,2,81,81,21,6,25,2,6,5,,.283,.324,.534,.370
Michael Soroka,RP/SP,Braves,,11976,647336,,$18.29,29,174.67,153,14,142,41,1,7,52,13,4,,1.111,2.68,3.32,,,,,,,,,,,,,,,,,,,,
Will Smith,RP,Giants,,1637,519293,smithwi04,$17.85,63,65.33,46,10,96,21,2,,20,6,,34,1.026,2.76,3.02,,,,,,,,,,,,,,,,,,,,
Roberto Osuna,RP,Astros,,6430,532077,,$17.80,66,65.00,45,8,73,12,,2,19,4,3,38,0.877,2.63,3.10,,,,,,,,,,,,,,,,,,,,
Liam Hendriks,RP,Athletics,,5513,521230,hendrli01,$17.56,75,85.00,61,5,124,21,5,2,17,4,4,25,0.965,1.80,1.58,,,,,,,,,,,,,,,,,,,,
Anthony Rizzo,1B,Cubs,,113,519203,rizzoan01,$16.14,,,,,,,,,,,,,,,,146,512,150,29,3,27,1,89,94,5,2,71,3,27,3,,.293,.405,.520,.401
Max Muncy,1B/2B/3B,Dodgers,,9385,571970,,$15.97,,,,,,,,,,,,,,,,141,487,122,22,1,35,7,101,98,4,1,90,1,8,4,,.251,.374,.515,.394
Yasmani Grandal,1B/C,Brewers,,4985,518735,grandya01,$15.49,,,,,,,,,,,,,,,,153,513,126,26,2,28,2,79,77,5,1,109,2,5,5,,.246,.380,.468,.374
Domingo Germán,RP/SP,Yankees,,10492,593334,,$15.42,27,143.00,125,30,153,39,,5,64,18,4,,1.147,4.03,4.61,,,,,,,,,,,,,,,,,,,,
Felipe Vázquez,RP,Pirates,,6163,553878,,$15.20,56,60.00,43,5,90,13,,4,11,5,1,28,0.933,1.65,2.03,,,,,,,,,,,,,,,,,,,,
Brandon Workman,RP,Red Sox,,6947,519443,workmbr01,$15.09,73,71.67,29,1,104,45,4,2,15,10,1,16,1.033,1.88,2.18,,,,,,,,,,,,,,,,,,,,
Aroldis Chapman,RP,Yankees,,2788,547973,chapmar01,$15.00,60,57.00,38,3,85,25,,1,14,3,2,37,1.105,2.21,2.17,,,,,,,,,,,,,,,,,,,,
Paul Goldschmidt,1B,Cardinals,,3648,502671,goldspa01,$14.55,,,,,,,,,,,,,,,,161,597,155,25,1,34,6,97,97,3,1,78,2,2,3,,.260,.346,.476,.364
Brad Hand,RP,Indians,,5110,543272,handbr01,$13.67,60,57.33,53,6,84,18,5,4,21,6,4,34,1.238,3.30,2.42,,,,,,,,,,,,,,,,,,,,
Kenley Jansen,RP,Dodgers,,4575,445276,janseke01,$12.71,62,63.00,51,9,80,16,,4,26,5,3,33,1.063,3.71,3.37,,,,,,,,,,,,,,,,,,,,
Taylor Rogers,RP,Twins,,10541,573124,,$11.68,60,69.00,58,8,90,11,2,6,20,2,4,30,1.000,2.61,2.65,,,,,,,,,,,,,,,,,,,,
Dakota Hudson,RP/SP,Cardinals,,12280,641712,,$11.18,33,174.67,160,22,136,86,8,9,65,16,7,1,1.408,3.35,4.67,,,,,,,,,,,,,,,,,,,,
Emilio Pagán,RP,Rays,,9516,641941,,$11.03,66,70.00,45,12,96,13,1,1,18,4,2,20,0.829,2.31,3.14,,,,,,,,,,,,,,,,,,,,
Héctor Neris,RP,Phillies,,5862,593576,,$10.62,68,67.67,45,10,89,24,1,6,22,3,6,28,1.020,2.93,3.68,,,,,,,,,,,,,,,,,,,,
Hansel Robles,RP,Angels,,6182,570663,,$10.46,71,72.67,58,6,75,16,1,,20,5,1,23,1.018,2.48,2.73,,,,,,,,,,,,,,,,,,,,
Matt Olson,1B,Athletics,,9384,621566,,$9.77,,,,,,,,,,,,,,,,127,483,129,26,,36,3,73,91,,,51,7,12,1,,.267,.351,.545,.383
Alex Colomé,RP,White Sox,,5543,517008,colomal01,$9.69,62,61.00,42,7,55,23,2,1,19,4,5,30,1.066,2.80,3.87,,,,,,,,,,,,,,,,,,,,
Raisel Iglesias,RP,Reds,,10452,628452,,$9.59,68,67.00,61,12,89,21,4,2,31,3,12,34,1.224,4.16,3.62,,,,,,,,,,,,,,,,,,,,
John Means,RP/SP,Orioles,,12305,607644,,$9.27,31,155.00,138,23,121,38,,5,62,12,11,,1.135,3.60,4.30,,,,,,,,,,,,,,,,,,,,
Christian Walker,1B,Diamondbacks,,6465,572233,,$8.42,,,,,,,,,,,,,,,,152,529,137,26,1,29,2,86,73,8,1,67,6,6,1,,.259,.348,.476,.360
Sean Doolittle,RP,Nationals,,4821,448281,doolise01,$7.86,63,60.00,63,11,66,15,2,2,27,6,5,29,1.300,4.05,4.03,,,,,,,,,,,,,,,,,,,,
Hunter Dozier,1B/3B/RF,Royals,,10142,641531,,$7.73,,,,,,,,,,,,,,,,139,523,146,29,10,26,3,75,84,2,2,55,2,3,5,,.279,.348,.522,.374
Ryan Yarbrough,RP/SP,Rays,,11939,642232,,$7.63,28,141.67,121,15,117,20,2,9,65,11,6,,0.995,4.13,3.40,,,,,,,,,,,,,,,,,,,,
Luke Jackson,RP,Braves,,10623,592426,,$7.46,70,72.67,76,10,106,26,4,2,31,9,2,18,1.404,3.84,2.96,,,,,,,,,,,,,,,,,,,,
Ian Kennedy,RP/SP,Royals,,3599,453178,kenneia01,$7.08,63,63.33,64,6,73,17,1,1,24,3,2,30,1.279,3.41,2.83,,,,,,,,,,,,,,,,,,,,
Ken Giles,RP,Blue Jays,,7400,571704,,$6.80,53,53.00,36,5,83,17,1,,11,2,3,23,1.000,1.87,2.10,,,,,,,,,,,,,,,,,,,,
Seth Lugo,RP,Mets,,11333,607625,,$6.66,61,80.00,56,8,104,16,4,5,24,7,4,6,0.900,2.70,2.44,,,,,,,,,,,,,,,,,,,,
Joc Pederson,1B/CF/LF/RF,Dodgers,,5344,592626,,$6.03,,,,,,,,,,,,,,,,149,450,112,16,3,36,2,83,74,1,1,50,2,12,2,,.249,.339,.538,.374
Edwin Encarnación,1B/DH,Yankees,,753,429665,encared01,$5.91,,,,,,,,,,,,,,,,109,418,102,18,,34,5,81,86,,1,58,1,7,3,,.244,.344,.531,.380
Eric Hosmer,1B,Padres,,5082,543333,hosmeer01,$5.05,,,,,,,,,,,,,,,,160,619,164,29,2,22,3,72,99,,3,40,3,3,5,,.265,.310,.425,.320
Daniel Hudson,RP,Nationals,,863,543339,hudsoda01,$5.02,69,73.00,56,8,71,27,2,4,20,9,3,8,1.137,2.47,3.77,,,,,,,,,,,,,,,,,,,,
Jordan Lyles,RP/SP,Brewers,,5135,543475,lylesjo01,$4.46,28,141.00,131,25,146,55,2,1,65,12,8,,1.319,4.15,4.48,,,,,,,,,,,,,,,,,,,,
Howie Kendrick,1B/2B/LF,Nationals,,1679,435062,kendrho01,$4.40,,,,,,,,,,,,,,,,121,334,115,23,1,17,4,61,62,2,1,27,1,4,5,,.344,.395,.572,.422
Caleb Smith,RP/SP,Marlins,,11607,592761,,$4.21,28,153.33,128,33,168,60,2,6,77,10,11,,1.226,4.52,4.96,,,,,,,,,,,,,,,,,,,,
Renato Núñez,1B/3B/DH,Orioles,,9535,600524,,$3.83,,,,,,,,,,,,,,,,151,541,132,24,,31,3,72,90,1,1,44,1,10,4,,.244,.311,.460,.336
Carlos Martínez,RP/SP,Cardinals,,6013,593372,martica04,$3.80,48,48.33,39,2,53,18,1,3,17,4,2,24,1.179,3.17,2.69,,,,,,,,,,,,,,,,,,,,
Shane Greene,RP,Tigers,,6283,572888,,$3.61,65,62.67,46,8,64,17,1,3,16,,3,23,1.005,2.30,3.63,,,,,,,,,,,,,,,,,,,,
Ryan McMahon,1B/2B/3B,Rockies,,10706,641857,,$3.59,,,,,,,,,,,,,,,,141,480,120,22,1,24,3,70,83,5,1,56,1,1,1,1,.250,.328,.450,.345
Travis d'Arnaud,1B/C,Rays,,723,518595,darnatr01,$2.84,,,,,,,,,,,,,,,,103,351,88,16,,16,2,52,69,,1,32,,2,6,,.251,.312,.433,.326
J.D. Davis,1B/3B/LF,Mets,,10929,605204,,$2.81,,,,,,,,,,,,,,,,140,410,126,22,1,22,5,65,57,3,,38,2,3,2,,.307,.369,.527,.396
Mark Canha,1B/CF/LF/RF,Athletics,,5757,592192,,$2.64,,,,,,,,,,,,,,,,126,410,112,16,3,26,4,80,58,3,2,67,1,18,2,,.273,.396,.517,.402
Rhys Hoskins,1B/LF,Phillies,,11705,656555,,$1.48,,,,,,,,,,,,,,,,160,570,129,33,5,29,4,86,85,2,2,116,6,11,6,,.226,.364,.454,.360
Albert Pujols,1B/DH,Angels,,3503,405395,pujolal01,$1.00,,,,,,,,,,,,,,,,131,491,120,22,,23,4,55,93,3,,43,1,3,8,,.244,.305,.430,.325
Eric Thames,1B/RF,Brewers,,798,519346,thameer01,$1.00,,,,,,,,,,,,,,,,149,396,98,23,2,25,,67,61,3,2,51,4,10,2,,.247,.346,.505,.362
Daniel Murphy,1B/2B,Rockies,,2133,502517,murphda08,$1.00,,,,,,,,,,,,,,,,132,438,122,35,1,13,3,56,78,1,1,32,1,2,4,,.279,.328,.452,.342
Junior Guerra,RP/SP,Brewers,,11108,448855,,$1.00,72,83.67,58,11,77,36,2,4,33,9,5,3,1.124,3.55,4.33,,,,,,,,,,,,,,,,,,,,
Archie Bradley,RP,Diamondbacks,,6439,605151,,$1.00,66,71.67,67,5,87,36,2,5,28,4,5,18,1.437,3.52,3.21,,,,,,,,,,,,,,,,,,,,
Edwin Díaz,RP,Mets,,11518,621242,,$1.00,66,58.00,58,15,99,22,3,4,36,2,7,26,1.379,5.59,4.24,,,,,,,,,,,,,,,,,,,,
Sergio Romo,RP,Marlins,,4075,489265,romose01,$1.00,65,60.33,50,7,60,17,3,2,23,2,1,20,1.110,3.43,3.41,,,,,,,,,,,,,,,,,,,,
Michael Lorenzen,OF/RP,Reds,,7445,547179,,$1.00,73,83.33,68,9,85,28,1,2,27,1,4,7,1.152,2.92,3.51,100,48,10,2,,1,1,6,6,5,2,5,,,,,.208,.283,.312,.292
Craig Stammen,RP,Padres,,2465,489334,stammcr01,$1.00,76,82.00,80,13,73,15,2,2,30,8,7,4,1.159,3.29,3.93,,,,,,,,,,,,,,,,,,,,
Yusmeiro Petit,RP,Athletics,,4267,433589,petityu01,$1.00,80,83.00,57,11,71,10,,,25,5,3,,0.807,2.71,3.47,,,,,,,,,,,,,,,,,,,,
Tyler Glasnow,RP/SP,Rays,,7453,607192,,$1.00,12,60.67,40,4,76,14,,,12,6,1,,0.890,1.78,2.14,,,,,,,,,,,,,,,,,,,,
Giovanny Gallegos,RP,Cardinals,,11578,606149,,$1.00,66,74.00,44,9,93,16,2,3,19,3,2,1,0.811,2.31,2.86,,,,,,,,,,,,,,,,,,,,
Julio Urías,RP/SP,Dodgers,,10018,628711,,$1.00,37,79.67,59,7,85,27,1,5,22,4,3,4,1.079,2.49,3.28,,,,,,,,,,,,,,,,,,,,
John Gant,RP,Cardinals,,11336,607231,,$1.00,64,66.33,51,4,60,34,1,,27,11,1,3,1.281,3.66,3.57,,,,,,,,,,,,,,,,,,,,
Pedro Báez,RP,Dodgers,,4657,520980,,$1.00,71,69.67,43,6,69,23,1,4,24,7,2,1,0.947,3.10,3.36,,,,,,,,,,,,,,,,,,,,
Will Harris,RP,Astros,,6139,501789,harriwi10,$1.00,68,60.00,42,6,62,14,,,10,4,1,4,0.933,1.50,3.03,,,,,,,,,,,,,,,,,,,,
Marcus Walden,RP,Red Sox,,7241,519393,,$1.00,70,78.00,61,6,76,32,1,5,33,9,2,2,1.192,3.81,3.54,,,,,,,,,,,,,,,,,,,,
Adam Ottavino,RP,Yankees,,3473,493603,ottavad01,$1.00,73,66.33,47,5,88,40,3,2,14,6,5,2,1.312,1.90,3.19,,,,,,,,,,,,,,,,,,,,
Scott Oberg,RP,Rockies,,7448,623184,,$1.00,49,56.00,39,5,58,23,2,,14,6,1,5,1.107,2.25,3.31,,,,,,,,,,,,,,,,,,,,
Mark Melancon,RP,Giants,,236,453343,melanma01,$1.00,66,67.33,71,4,68,18,2,2,27,5,2,12,1.322,3.61,2.65,,,,,,,,,,,,,,,,,,,,
Adrian Houser,RP,Brewers,,11277,605288,,$1.00,35,111.33,101,14,117,37,2,5,46,6,7,,1.240,3.72,3.71,,,,,,,,,,,,,,,,,,,,
Diego Castillo,RP,Rays,,11831,650895,,$1.00,65,68.67,59,8,81,26,4,5,26,5,8,8,1.238,3.41,3.43,,,,,,,,,,,,,,,,,,,,
Nick Anderson,RP,Rays,,12338,623433,,$1.00,68,65.00,52,8,110,18,4,2,24,5,4,1,1.077,3.32,2.05,,,,,,,,,,,,,,,,,,,,
José Leclerc,RP,Rangers,,10838,600917,,$-0.81,70,68.67,52,7,100,39,1,6,33,2,4,14,1.325,4.33,3.43,,,,,,,,,,,,,,,,,,,,
Trevor May,RP,Twins,,6155,543507,,$-0.89,65,64.33,43,8,79,26,1,3,21,5,3,2,1.073,2.94,3.57,,,,,,,,,,,,,,,,,,,,
Tyler Duffey,RP,Twins,,10540,608648,,$-1.07,58,57.67,44,8,82,14,1,3,16,5,1,,1.006,2.50,2.89,,,,,,,,,,,,,,,,,,,,
Nick Wittgren,RP,Indians,,7391,621295,,$-1.46,55,57.67,47,10,60,15,1,,18,5,1,4,1.075,2.81,4.00,,,,,,,,,,,,,,,,,,,,
Blake Treinen,RP,Athletics,,5673,595014,,$-1.63,57,58.67,58,9,59,37,1,1,32,6,5,16,1.619,4.91,4.97,,,,,,,,,,,,,,,,,,,,
Joey Votto,1B,Reds,,2825,458015,vottojo01,$-1.86,,,,,,,,,,,,,,,,142,525,137,32,1,15,9,79,47,5,,76,2,4,3,,.261,.357,.411,.356
Matt Barnes,RP,Red Sox,,6440,598264,,$-1.91,70,64.33,51,8,110,38,2,2,27,5,4,4,1.383,3.78,3.07,,,,,,,,,,,,,,,,,,,,
Steve Cishek,RP,Cubs,,4979,518553,cishest01,$-1.93,70,64.00,48,7,57,29,1,7,21,4,6,7,1.203,2.95,4.38,,,,,,,,,,,,,,,,,,,,
Oliver Drake,RP,Rays,,5539,543118,,$-1.99,50,56.00,36,9,70,19,1,1,20,5,2,2,0.982,3.21,3.71,,,,,,,,,,,,,,,,,,,,
Luke Voit,1B/DH,Yankees,,11475,572228,,$-2.20,,,,,,,,,,,,,,,,118,429,113,21,1,21,2,72,62,,,71,2,9,1,,.263,.378,.464,.373
C.J. Cron,1B/DH,Twins,,6756,543068,,$-2.59,,,,,,,,,,,,,,,,125,458,116,24,,25,5,51,78,,,29,3,10,2,,.253,.311,.469,.343
Ryan Pressly,RP,Astros,,6297,519151,pressry01,$-2.67,55,54.33,37,6,72,12,,,14,2,3,3,0.902,2.32,2.55,,,,,,,,,,,,,,,,,,,,
Joe Jiménez,RP,Tigers,,11842,641729,,$-2.84,66,59.67,56,13,82,23,1,4,29,4,7,9,1.324,4.37,4.49,,,,,,,,,,,,,,,,,,,,
Mychal Givens,RP,Orioles,,5739,571710,,$-2.84,58,63.00,49,13,86,26,1,2,32,2,6,11,1.190,4.57,4.34,,,,,,,,,,,,,,,,,,,,
Matt Strahm,RP,Padres,,11287,621381,,$-2.84,46,114.67,121,22,118,22,4,7,60,6,11,,1.247,4.71,4.19,,,,,,,,,,,,,,,,,,,,
Brad Keller,RP/SP,Royals,,11946,641745,,$-2.86,28,165.33,154,15,122,70,2,9,77,7,14,,1.355,4.19,4.20,,,,,,,,,,,,,,,,,,,,
Brad Peacock,RP/SP,Astros,,5516,502748,peacobr01,$-2.91,23,91.67,78,15,96,31,,5,42,7,6,,1.189,4.12,4.31,,,,,,,,,,,,,,,,,,,,
Ty Buttrey,RP,Angels,,11754,621142,,$-3.01,72,72.33,69,8,84,23,,5,32,6,7,2,1.272,3.98,3.38,,,,,,,,,,,,,,,,,,,,
Zack Britton,RP,Yankees,,5021,502154,brittza01,$-3.29,66,61.33,38,3,53,32,1,1,13,3,1,3,1.141,1.91,3.57,,,,,,,,,,,,,,,,,,,,
Sam Dyson,RP,Giants,,6131,473879,dysonsa01,$-3.35,61,62.33,53,6,55,13,,3,23,5,1,2,1.059,3.32,3.36,,,,,,,,,,,,,,,,,,,,
Jordan Hicks,RP,Cardinals,,12228,663855,,$-3.42,29,28.67,16,2,31,11,,1,10,2,2,14,0.942,3.14,3.10,,,,,,,,,,,,,,,,,,,,
Roenis Elías,RP/SP,Mariners,,7079,606273,,$-3.44,48,50.00,46,10,47,18,1,1,22,4,2,14,1.280,3.96,4.90,,,,,,,,,,,,,,,,,,,,
Daniel Vogelbach,1B/DH,Mariners,,6495,596129,,$-3.99,,,,,,,,,,,,,,,,144,462,96,17,,30,2,73,76,,,92,2,2,2,,.208,.341,.439,.345
Blake Parker,RP,Phillies,,2601,453284,parkebl01,$-4.04,60,61.33,53,13,65,22,,3,31,3,3,10,1.223,4.55,4.96,,,,,,,,,,,,,,,,,,,,
Chad Green,RP,Yankees,,11514,643338,,$-4.31,54,69.00,66,10,98,19,,6,32,4,4,2,1.232,4.17,3.23,,,,,,,,,,,,,,,,,,,,
Jairo Díaz,RP,Rockies,,10477,545064,,$-4.32,56,57.67,56,7,63,19,,2,29,6,4,5,1.301,4.53,3.59,,,,,,,,,,,,,,,,,,,,
Trevor Gott,RP,Giants,,10233,641627,,$-4.35,50,52.67,41,4,57,17,,2,26,7,,1,1.101,4.44,3.01,,,,,,,,,,,,,,,,,,,,
Andrew Miller,RP,Cardinals,,1952,453192,millean01,$-4.36,73,54.67,45,11,70,27,1,8,27,5,6,6,1.317,4.45,5.02,,,,,,,,,,,,,,,,,,,,
Buck Farmer,RP,Tigers,,10463,571656,,$-4.49,73,67.67,62,8,73,24,2,5,28,6,6,,1.271,3.72,3.68,,,,,,,,,,,,,,,,,,,,
Shawn Kelley,RP,Rangers,,4229,518875,kellesh01,$-4.69,51,47.33,55,12,43,11,2,2,26,5,2,11,1.394,4.94,5.28,,,,,,,,,,,,,,,,,,,,
Colin Poche,RP,Rays,,12478,621363,,$-4.70,51,51.67,33,9,72,19,1,5,27,5,5,2,1.006,4.70,3.91,,,,,,,,,,,,,,,,,,,,
Noé Ramirez,RP,Angels,,7461,598287,,$-4.75,51,67.67,59,9,79,20,1,5,30,5,4,,1.167,3.99,3.56,,,,,,,,,,,,,,,,,,,,
Adam Kolarek,RP,Dodgers,,7114,592473,,$-4.76,80,55.00,48,7,45,16,4,3,20,6,3,1,1.164,3.27,3.94,,,,,,,,,,,,,,,,,,,,
Matt Albers,RP,Brewers,,370,458006,alberma01,$-4.78,67,59.67,53,8,57,29,3,3,34,8,6,4,1.374,5.13,4.39,,,,,,,,,,,,,,,,,,,,
Ian Desmond,1B/CF/LF,Rockies,,2521,435622,desmoia01,$-4.88,,,,,,,,,,,,,,,,140,443,113,31,4,20,2,64,65,3,3,34,1,2,2,1,.255,.309,.479,.339
Brandon Belt,1B,Giants,,4113,474832,beltbr01,$-4.90,,,,,,,,,,,,,,,,156,526,123,32,3,17,2,76,57,4,3,83,3,3,4,,.234,.339,.403,.330
Wander Suero,RP,Nationals,,11403,593833,,$-4.90,78,71.33,64,5,81,26,3,3,36,6,9,1,1.262,4.54,2.83,,,,,,,,,,,,,,,,,,,,
Tommy Kahnle,RP,Yankees,,6287,592454,,$-5.06,72,61.33,45,9,88,20,,2,25,3,2,,1.060,3.67,3.21,,,,,,,,,,,,,,,,,,,,
Greg Holland,RP,Diamondbacks,,4965,518813,hollagr01,$-5.07,40,35.67,25,5,41,24,2,,18,1,2,17,1.374,4.54,4.47,,,,,,,,,,,,,,,,,,,,
Robert Stephenson,RP,Reds,,6319,596112,,$-5.31,57,64.67,43,9,81,24,4,,27,3,2,,1.036,3.76,3.33,,,,,,,,,,,,,,,,,,,,
Ji Man Choi,1B/DH,Rays,,7377,596847,,$-5.34,,,,,,,,,,,,,,,,127,410,107,20,2,19,2,54,63,2,3,64,2,6,7,,.261,.363,.459,.359
Matt Magill,RP,Mariners,,6205,543483,magilma01,$-5.40,50,50.67,51,7,64,20,3,2,23,5,2,5,1.401,4.09,3.49,,,,,,,,,,,,,,,,,,,,
John Brebbia,RP,Cardinals,,11846,605154,,$-5.48,66,72.67,59,6,87,27,2,3,29,3,4,,1.183,3.59,2.93,,,,,,,,,,,,,,,,,,,,
Sean Newcomb,RP/SP,Braves,,10545,656794,,$-5.56,55,68.33,61,8,65,29,1,3,24,6,3,1,1.317,3.16,4.08,,,,,,,,,,,,,,,,,,,,
Brandon Kintzler,RP,Cubs,,4976,445213,kintzbr01,$-5.58,62,57.00,45,5,48,13,3,4,17,3,3,1,1.018,2.68,3.29,,,,,,,,,,,,,,,,,,,,
Aaron Bummer,RP,White Sox,,11858,607481,,$-5.61,58,67.67,43,4,60,24,2,3,16,,,1,0.990,2.13,3.20,,,,,,,,,,,,,,,,,,,,
Tyler Clippard,RP,Indians,,2427,461325,clippty01,$-5.76,53,62.00,38,8,64,15,,7,20,1,,,0.855,2.90,3.78,,,,,,,,,,,,,,,,,,,,
Jurickson Profar,1B/2B/3B/SS,Athletics,,5170,595777,profaju01,$-5.77,,,,,,,,,,,,,,,,139,459,100,24,2,20,1,65,67,9,1,48,2,8,3,,.218,.301,.410,.314
Amir Garrett,RP,Reds,,10503,607237,,$-5.81,69,56.00,44,7,78,35,1,4,20,5,3,,1.411,3.21,3.98,,,,,,,,,,,,,,,,,,,,
Jared Hughes,RP,Phillies,,5469,453172,hugheja02,$-6.02,72,71.33,57,13,54,27,1,2,32,5,5,1,1.178,4.04,5.13,,,,,,,,,,,,,,,,,,,,
Cam Bedrosian,RP,Angels,,9531,592135,,$-6.06,59,61.33,48,7,64,22,,3,22,3,3,1,1.141,3.23,3.72,,,,,,,,,,,,,,,,,,,,
Garrett Cooper,1B/RF,Marlins,,9475,643265,,$-6.16,,,,,,,,,,,,,,,,107,381,107,16,1,15,3,52,50,,,33,,5,2,,.281,.344,.446,.352
Chris Martin,RP,Rangers,,6859,455119,,$-6.25,58,55.67,52,9,65,5,,,21,1,3,4,1.024,3.40,3.14,,,,,,,,,,,,,,,,,,,,
Justin Wilson,RP,Mets,,5111,458677,wilsoju10,$-6.33,45,39.00,33,4,44,19,1,2,11,4,2,4,1.333,2.54,3.72,,,,,,,,,,,,,,,,,,,,
Wilmer Font,RP,Blue Jays,,5054,521655,fontwi01,$-6.49,48,84.33,78,17,95,29,2,3,42,4,5,,1.269,4.48,4.53,,,,,,,,,,,,,,,,,,,,
Tyler Chatwood,RP/SP,Cubs,,1616,543022,chatwty01,$-6.62,38,76.67,65,8,74,37,,5,32,5,3,2,1.330,3.76,4.17,,,,,,,,,,,,,,,,,,,,
Anthony Bass,RP,Mariners,,5098,542914,bassan01,$-6.67,44,48.00,30,5,43,17,2,1,19,2,4,5,0.979,3.56,3.66,,,,,,,,,,,,,,,,,,,,
Mitch Moreland,1B,Red Sox,,4519,519048,morelmi01,$-6.72,,,,,,,,,,,,,,,,91,298,75,17,1,19,3,48,58,1,,34,,1,2,,.252,.328,.507,.366
Joakim Soria,RP,Athletics,,1341,465657,soriajo01,$-6.78,71,69.00,51,9,79,20,1,3,33,2,4,1,1.029,4.30,3.46,,,,,,,,,,,,,,,,,,,,
Casey Sadler,RP,Dodgers,,7111,594987,,$-6.89,33,46.33,41,5,31,13,2,4,11,4,,1,1.165,2.14,4.14,,,,,,,,,,,,,,,,,,,,
Jacob Webb,RP,Braves,,12307,657097,,$-6.90,36,32.33,24,4,28,12,,1,5,4,,2,1.113,1.39,4.18,,,,,,,,,,,,,,,,,,,,
Yimi García,RP,Dodgers,,6811,554340,,$-7.00,64,62.33,40,15,66,14,2,6,25,1,4,,0.866,3.61,4.98,,,,,,,,,,,,,,,,,,,,
Sam Gaviglio,RP/SP,Blue Jays,,7427,543208,,$-7.11,52,95.67,85,18,88,22,,4,49,4,2,,1.118,4.61,4.52,,,,,,,,,,,,,,,,,,,,
Reyes Moronta,RP,Giants,,11574,606625,,$-7.14,56,56.67,41,4,70,33,1,3,18,3,7,,1.306,2.86,3.40,,,,,,,,,,,,,,,,,,,,
Freddy Peralta,RP/SP,Brewers,,11920,642547,,$-7.30,39,85.00,87,15,115,37,1,2,50,7,3,1,1.459,5.29,4.03,,,,,,,,,,,,,,,,,,,,
Josh James,RP/SP,Astros,,12296,657624,,$-7.33,49,61.33,46,10,100,35,,4,32,5,1,1,1.321,4.70,3.87,,,,,,,,,,,,,,,,,,,,
Pedro Strop,RP,Cubs,,4425,467008,stroppe01,$-7.33,50,41.67,33,6,49,20,1,5,23,2,5,10,1.272,4.97,4.35,,,,,,,,,,,,,,,,,,,,
Jarlín García,RP,Marlins,,11335,606424,,$-7.41,53,50.67,40,4,39,16,2,2,17,4,2,,1.105,3.02,3.53,,,,,,,,,,,,,,,,,,,,
Michael Feliz,RP,Pirates,,10504,593140,,$-7.41,58,56.33,44,11,73,27,1,2,25,4,4,,1.260,3.99,4.54,,,,,,,,,,,,,,,,,,,,
Richard Rodríguez,RP,Pirates,,11790,593144,,$-7.57,72,65.33,65,14,63,23,3,2,27,4,5,1,1.347,3.72,4.97,,,,,,,,,,,,,,,,,,,,
Ryne Harper,RP,Twins,,7073,607560,,$-7.62,61,54.33,54,7,50,10,,1,23,4,2,1,1.178,3.81,3.54,,,,,,,,,,,,,,,,,,,,
Niko Goodrum,1B/2B/LF/SS,Tigers,,6048,592348,,$-7.74,,,,,,,,,,,,,,,,112,423,105,27,5,12,3,61,45,12,3,46,1,1,2,,.248,.322,.421,.333
Evan Marshall,RP,White Sox,,5637,605359,,$-7.82,55,50.67,42,5,41,24,2,,14,4,2,,1.303,2.49,4.07,,,,,,,,,,,,,,,,,,,,
Matt Andriese,RP,Diamondbacks,,6065,542882,,$-7.84,54,70.67,72,8,79,27,4,3,37,5,5,1,1.401,4.71,3.44,,,,,,,,,,,,,,,,,,,,
Adam Cimber,RP,Indians,,11968,643256,,$-8.17,68,56.67,56,6,41,19,2,4,28,6,3,1,1.324,4.45,4.14,,,,,,,,,,,,,,,,,,,,
Jacob Waguespack,RP,Blue Jays,,12365,621097,,$-8.17,16,78.00,75,12,63,29,,5,38,5,5,,1.333,4.38,4.79,,,,,,,,,,,,,,,,,,,,
Josh Osich,RP,White Sox,,6379,592612,,$-8.20,57,67.67,62,15,61,15,1,,35,4,,,1.138,4.66,4.80,,,,,,,,,,,,,,,,,,,,
Ryan Brasier,RP,Red Sox,,1642,518489,brasiry01,$-8.22,62,55.67,51,9,61,21,1,3,30,2,4,7,1.293,4.85,4.25,,,,,,,,,,,,,,,,,,,,
Joey Gallo,1B/CF/LF,Rangers,,6323,608336,,$-8.25,,,,,,,,,,,,,,,,70,241,61,15,1,22,,54,49,4,2,52,4,2,1,1,.253,.387,.598,.411
Francisco Liriano,RP/SP,Pirates,,1502,434538,liriafr01,$-8.33,69,70.00,60,8,63,35,1,3,27,5,3,,1.357,3.47,4.37,,,,,,,,,,,,,,,,,,,,
Jalen Beeks,RP/SP,Rays,,11882,656222,,$-8.34,33,104.33,115,12,89,40,1,9,50,6,3,1,1.486,4.31,4.27,,,,,,,,,,,,,,,,,,,,
Victor Caratini,1B/C,Cubs,,10250,605170,,$-8.36,,,,,,,,,,,,,,,,95,244,65,11,,11,2,31,34,1,,29,,3,3,,.266,.348,.447,.354
Joe Kelly,RP,Dodgers,,5067,523260,kellyjo05,$-8.38,55,51.33,49,6,62,22,2,3,26,5,4,1,1.383,4.56,3.55,,,,,,,,,,,,,,,,,,,,
Carlos Estévez,RP,Rockies,,11322,608032,,$-8.43,71,72.00,70,12,81,23,1,1,30,2,2,,1.292,3.75,3.98,,,,,,,,,,,,,,,,,,,,
Zack Littell,RP/SP,Twins,,11904,641793,,$-8.46,29,37.00,34,4,32,9,1,,11,6,,,1.162,2.68,3.42,,,,,,,,,,,,,,,,,,,,
Kyle Ryan,RP,Cubs,,7567,594986,,$-8.50,73,61.00,55,5,58,29,2,1,24,4,2,,1.377,3.54,3.64,,,,,,,,,,,,,,,,,,,,
Ranger Suárez,RP/SP,Phillies,,11890,624133,,$-8.54,37,48.67,52,6,42,12,2,1,17,6,1,,1.315,3.14,3.65,,,,,,,,,,,,,,,,,,,,
Tyler Webb,RP,Cardinals,,10611,643778,,$-8.66,65,55.00,33,7,48,23,3,2,23,2,1,1,1.018,3.76,4.21,,,,,,,,,,,,,,,,,,,,
Yoshihisa Hirano,RP,Diamondbacks,,11957,673633,,$-8.74,62,53.00,51,7,61,22,2,3,28,5,5,1,1.377,4.75,3.82,,,,,,,,,,,,,,,,,,,,
Miguel Cabrera,1B/DH,Tigers,,1210,408234,cabremi01,$-8.76,,,,,,,,,,,,,,,,136,493,139,21,,12,3,41,59,,,48,4,3,5,,.282,.346,.398,.333
Josh Tomlin,RP/SP,Braves,,979,458708,tomlijo01,$-9.20,51,79.33,82,14,51,7,,,33,2,1,2,1.122,3.74,4.37,,,,,,,,,,,,,,,,,,,,
Dylan Floro,RP,Dodgers,,10260,571670,,$-9.26,50,46.67,46,4,42,14,5,2,22,5,3,,1.286,4.24,3.12,,,,,,,,,,,,,,,,,,,,
Miguel Rojas,1B/3B/SS,Marlins,,2847,500743,,$-9.35,,,,,,,,,,,,,,,,132,483,137,29,1,5,3,52,46,9,5,32,2,5,5,1,.284,.331,.379,.319
Javy Guerra,RP,Nationals,,4601,457915,guerrja01,$-9.40,51,67.67,67,10,57,17,3,1,35,3,1,2,1.241,4.66,4.00,,,,,,,,,,,,,,,,,,,,
Collin McHugh,RP/SP,Astros,,6145,543521,mchugco01,$-9.43,35,74.67,62,12,82,30,,3,39,4,5,,1.232,4.70,4.32,,,,,,,,,,,,,,,,,,,,
Marwin Gonzalez,1B/2B/3B/LF/RF/SS,Twins,,2731,503556,gonzama01,$-9.50,,,,,,,,,,,,,,,,114,425,112,19,,15,1,52,55,1,,31,2,6,1,,.264,.322,.414,.325
Michael Chavis,1B/2B/3B,Red Sox,,12321,656308,,$-9.52,,,,,,,,,,,,,,,,95,347,88,10,1,18,2,46,58,2,1,31,2,4,,,.254,.322,.444,.337
Hector Rondón,RP,Astros,,1001,444468,rondohe01,$-9.59,62,60.67,56,10,48,20,,4,25,3,2,,1.253,3.71,4.85,,,,,,,,,,,,,,,,,,,,
José Álvarez,RP,Phillies,,4912,501625,alvarjo02,$-9.62,67,59.00,66,8,51,18,4,1,22,3,4,1,1.424,3.36,3.90,,,,,,,,,,,,,,,,,,,,
Drew Pomeranz,RP/SP,Brewers,,5088,519141,pomerdr01,$-9.68,46,104.00,105,21,137,44,,4,56,2,10,2,1.433,4.85,4.47,,,,,,,,,,,,,,,,,,,,
Austin Voth,RP,Nationals,,11552,608723,,$-9.83,9,43.67,33,5,44,13,2,3,16,2,1,,1.053,3.30,3.54,,,,,,,,,,,,,,,,,,,,
Keone Kela,RP,Pirates,,10083,605309,,$-9.87,32,29.67,19,3,33,11,,1,7,2,,1,1.011,2.12,3.40,,,,,,,,,,,,,,,,,,,,
J.B. Wendelken,RP,Athletics,,11300,605525,,$-9.93,27,32.67,21,2,34,9,2,2,13,3,1,,0.918,3.58,2.64,,,,,,,,,,,,,,,,,,,,
Nick Goody,RP,Indians,,6286,580792,,$-10.08,39,40.67,30,7,50,22,1,,16,3,2,,1.279,3.54,4.43,,,,,,,,,,,,,,,,,,,,
Andrew Chafin,RP,Diamondbacks,,6574,605177,,$-10.17,77,52.67,52,6,68,18,,2,22,2,2,,1.329,3.76,3.14,,,,,,,,,,,,,,,,,,,,
Scott Barlow,RP/SP,Royals,,11941,605130,,$-10.24,61,70.33,64,6,92,37,3,3,33,3,3,1,1.436,4.22,3.17,,,,,,,,,,,,,,,,,,,,
Jesse Chavez,RP,Rangers,,1776,445926,chaveje01,$-10.24,48,78.00,82,12,72,22,,5,42,3,5,1,1.333,4.85,4.29,,,,,,,,,,,,,,,,,,,,
Anthony Swarzak,RP,Braves,,1510,461872,swarzan01,$-10.32,59,53.33,52,12,52,27,3,,27,3,4,4,1.481,4.56,5.43,,,,,,,,,,,,,,,,,,,,
Kevin Ginkel,RP/SP,Diamondbacks,,12652,656464,,$-10.44,25,24.33,15,2,28,9,,,4,3,,2,0.986,1.48,2.98,,,,,,,,,,,,,,,,,,,,
Rafael Montero,RP,Rangers,,6241,606160,,$-10.57,22,29.00,23,5,34,5,,2,8,2,,,0.966,2.48,3.72,,,,,,,,,,,,,,,,,,,,
Josh Taylor,RP/SP,Red Sox,,12324,657031,,$-10.58,52,47.33,40,5,62,16,1,2,16,2,2,,1.183,3.04,2.93,,,,,,,,,,,,,,,,,,,,
Tim Hill,RP,Royals,,11749,657612,,$-10.62,46,39.67,31,4,39,13,2,4,16,2,,1,1.109,3.63,3.58,,,,,,,,,,,,,,,,,,,,
Nick Ramirez,1B/RP,Tigers,,5714,598286,,$-10.75,46,79.67,76,11,74,35,4,1,36,5,4,,1.393,4.07,4.24,3,1,,,,,,,,,,,,,,,,,,
Matt Adams,1B,Nationals,,5355,571431,adamsma01,$-10.85,,,,,,,,,,,,,,,,111,310,70,14,,20,2,42,56,,,20,1,2,1,,.226,.276,.465,.320
Yoan López,RP/SP,Diamondbacks,,10600,661255,,$-10.87,70,60.67,52,11,42,17,2,,23,2,7,1,1.137,3.41,4.81,,,,,,,,,,,,,,,,,,,,