Player,Position,ProTeam,RotoTeam,RVid,MLBAMID,BDBID,RotoValue,bG,bAB,bH,b2B,b3B,bHR,bTB,bR,bRBI,bSB,bBB,bHBP,bSF,bSH,bAvg,bOBP,pG,pIP,pH,pK,pBB,pER,pWin,pSav,pHld,pS+H,pWHIP,pERA
Shohei Ohtani,DH/SP,Angels,,11942,660271,,$90.07,157,586,160,30,6,34,304,90,95,11,72,5,3,,.273,.356,28,166.00,124,219,44,43,15,,,,1.012,2.33
Aaron Judge,CF/DH/RF,Yankees,,10614,592450,,$65.28,157,570,177,28,,62,391,133,131,16,111,6,5,,.311,.425,,,,,,,,,,,,
Freddie Freeman,1B,Dodgers,,1836,518692,freemfr01,$52.37,159,612,199,47,2,21,313,117,100,13,84,5,7,,.325,.407,,,,,,,,,,,,
Paul Goldschmidt,1B/DH,Cardinals,,3648,502671,goldspa01,$46.53,151,561,178,41,,35,324,106,115,7,79,5,4,,.317,.404,,,,,,,,,,,,
José Ramírez,3B/DH,Guardians,,6941,608070,ramirjo01,$40.54,157,601,168,44,5,29,309,90,126,20,69,6,9,,.280,.355,,,,,,,,,,,,
Pete Alonso,1B/DH,Mets,,12005,624413,,$32.23,160,597,162,27,,40,309,95,131,5,67,12,9,,.271,.352,,,,,,,,,,,,
Yordan Alvarez,DH/LF,Astros,,12011,670541,,$31.62,135,470,144,29,2,37,288,95,97,1,78,6,7,,.306,.406,,,,,,,,,,,,
Randy Arozarena,DH/LF/RF,Rays,,12085,668227,,$28.27,153,586,154,41,3,20,261,72,89,32,46,11,2,,.263,.327,,,,,,,,,,,,
Jeff McNeil,2B/DH/LF,Mets,,10691,643446,,$26.42,148,533,174,39,1,9,242,73,62,4,40,11,5,,.326,.382,,,,,,,,,,,,
Vladimir Guerrero,1B/DH,Blue Jays,,12256,665489,,$26.25,160,638,175,35,,32,306,90,97,8,58,6,4,,.274,.339,,,,,,,,,,,,
Will Smith,C/DH,Dodgers,,12969,669257,,$25.90,137,508,132,26,3,24,236,68,87,1,56,10,4,,.260,.343,,,,,,,,,,,,
José Abreu,1B/DH,White Sox,,7346,547989,,$25.01,157,601,183,40,,15,268,85,75,,62,12,4,,.304,.378,,,,,,,,,,,,
Adolis García,CF/DH/RF,Rangers,,12084,666969,,$24.46,156,605,151,34,5,27,276,88,101,25,40,6,6,,.250,.300,,,,,,,,,,,,
Austin Riley,3B/DH,Braves,,11974,663586,,$24.34,159,615,168,39,2,38,325,90,93,2,57,17,4,,.273,.349,,,,,,,,,,,,
Luis Arraez,1B/2B/3B/DH/LF,Twins,,12358,650333,,$24.14,144,547,173,31,1,8,230,88,49,4,50,3,3,,.316,.375,,,,,,,,,,,,
Alejandro Kirk,C/DH,Blue Jays,,13066,672386,,$23.37,139,470,134,19,,14,195,59,63,,63,4,4,,.285,.372,,,,,,,,,,,,
Nathaniel Lowe,1B,Rangers,,12115,663993,,$22.22,157,593,179,26,3,27,292,74,76,2,48,4,,,.302,.358,,,,,,,,,,,,
Christian Yelich,DH/LF,Brewers,,5764,592885,yelicch01,$19.78,154,575,145,25,4,14,220,99,57,19,88,5,2,1,.252,.355,,,,,,,,,,,,
George Springer,CF/DH/RF,Blue Jays,,5594,543807,,$19.65,133,513,137,22,4,25,242,89,76,14,54,7,5,,.267,.342,,,,,,,,,,,,
Sean Murphy,C/DH,Athletics,,7262,669221,,$19.30,148,537,134,37,2,18,229,67,66,1,56,13,5,,.250,.332,,,,,,,,,,,,
Ronald Acuña,DH/RF,Braves,,11729,660670,,$17.69,119,467,124,24,,15,193,71,50,29,53,10,3,,.266,.351,,,,,,,,,,,,
Willson Contreras,C/DH,Cubs,,6038,575929,,$16.77,113,416,101,23,2,22,194,65,55,4,45,24,2,,.243,.349,,,,,,,,,,,,
Adley Rutschman,C/DH,Orioles,,13081,668939,,$16.67,113,398,101,35,1,13,177,70,42,4,65,4,3,,.254,.362,,,,,,,,,,,,
Brandon Drury,1B/2B/3B/DH,Reds,,5891,592273,,$15.93,138,518,136,31,2,28,255,87,87,2,38,8,4,,.263,.320,,,,,,,,,,,,
Kyle Schwarber,DH/LF,Phillies,,10616,656941,,$15.78,155,577,126,21,3,46,291,100,94,10,86,4,2,,.218,.323,,,,,,,,,,,,
Yandy Díaz,1B/3B,Rays,,10071,650490,,$14.86,137,473,140,33,,9,200,71,57,3,78,6,1,,.296,.401,,,,,,,,,,,,
Ty France,1B/2B/DH,Mariners,,12331,664034,,$13.76,140,551,151,27,1,20,240,65,83,,35,21,5,,.274,.338,,,,,,,,,,,,
Matt Olson,1B,Braves,,9384,621566,,$13.53,162,616,148,44,,34,294,86,103,,75,4,4,,.240,.325,,,,,,,,,,,,
Jake Cronenworth,1B/2B/SS,Padres,,12444,630105,,$13.45,158,587,140,30,4,17,229,88,88,3,70,16,8,,.239,.332,,,,,,,,,,,,
William Contreras,C/DH,Braves,,12394,661388,,$13.05,97,334,93,14,1,20,169,51,45,2,39,1,2,,.278,.354,,,,,,,,,,,,
Christian Walker,1B,Diamondbacks,,6465,572233,,$12.30,160,583,141,25,2,36,278,84,94,2,69,8,7,,.242,.327,,,,,,,,,,,,
C.J. Cron,1B/DH,Rockies,,6756,543068,,$12.23,150,575,148,28,3,29,269,79,102,,43,8,5,,.257,.315,,,,,,,,,,,,
Salvador Perez,C/DH,Royals,,5081,521692,perezsa02,$12.08,114,445,113,23,1,23,207,48,76,,18,7,3,,.254,.292,,,,,,,,,,,,
Josh Bell,1B/DH,Nationals,,6324,605137,,$11.80,156,552,147,29,3,17,233,78,71,,81,5,6,,.266,.362,,,,,,,,,,,,
Bryce Harper,DH/RF,Phillies,,5074,547180,harpebr03,$10.71,99,370,106,28,1,18,190,63,65,11,46,3,7,,.286,.364,,,,,,,,,,,,
Rhys Hoskins,1B,Phillies,,11705,656555,,$10.33,156,589,145,33,2,30,272,81,79,2,72,6,4,,.246,.332,,,,,,,,,,,,
Teoscar Hernández,DH/LF/RF,Blue Jays,,9446,606192,,$9.45,131,499,133,35,1,25,245,71,77,6,34,2,,,.267,.316,,,,,,,,,,,,
Justin Turner,3B/DH,Dodgers,,446,457759,turneju01,$9.28,128,468,130,36,,13,205,61,81,3,50,6,8,,.278,.350,,,,,,,,,,,,
J.D. Martinez,DH/LF,Red Sox,,5186,502110,martijd02,$8.42,139,533,146,43,1,16,239,76,62,,52,5,5,,.274,.341,,,,,,,,,,,,
MJ Melendez,C/DH/LF,Royals,,12569,669004,,$8.06,129,460,100,21,3,18,181,57,62,2,66,1,7,,.217,.313,,,,,,,,,,,,
Anthony Santander,DH/LF/RF,Orioles,,11612,623993,,$7.02,152,574,138,24,,33,261,78,89,,55,13,5,,.240,.318,,,,,,,,,,,,
DJ LeMahieu,1B/2B/3B,Yankees,,2658,518934,lemahdj01,$6.61,125,467,122,18,,12,176,74,46,4,67,4,2,1,.261,.357,,,,,,,,,,,,
Jake McCarthy,CF/DH/LF/RF,Diamondbacks,,13454,664983,,$5.46,99,321,91,16,3,8,137,53,43,23,23,6,1,3,.283,.339,,,,,,,,,,,,
Anthony Rizzo,1B,Yankees,,113,519203,rizzoan01,$5.33,130,465,104,21,1,32,223,77,75,6,58,23,2,,.224,.338,,,,,,,,,,,,
Jurickson Profar,1B/CF/LF/RF,Padres,,5170,595777,profaju01,$5.03,152,575,140,36,2,15,225,82,58,5,73,4,3,3,.243,.330,,,,,,,,,,,,
Charlie Blackmon,DH/RF,Rockies,,5147,453568,blackch02,$4.81,135,530,140,22,6,16,222,60,78,4,32,8,3,4,.264,.312,,,,,,,,,,,,
Ryan Mountcastle,1B/DH/LF,Orioles,,11789,663624,,$4.33,145,555,139,28,1,22,235,62,85,4,43,4,7,,.250,.305,,,,,,,,,,,,
Andrew Vaughn,1B/DH/LF/RF,White Sox,,13192,683734,,$3.86,134,510,138,28,1,17,219,60,76,,31,9,5,,.271,.321,,,,,,,,,,,,
Josh Naylor,1B/DH/LF/RF,Guardians,,11973,647304,,$1.98,122,449,115,28,,20,203,47,79,6,38,6,5,,.256,.319,,,,,,,,,,,,
Ketel Marte,2B/CF/DH,Diamondbacks,,6003,606466,,$1.96,137,492,118,42,2,12,200,68,52,5,55,6,5,,.240,.321,,,,,,,,,,,,
Jose Miranda,1B/2B/3B/DH,Twins,,13708,669304,,$1.49,125,444,119,25,,15,189,45,66,1,28,10,1,,.268,.325,,,,,,,,,,,,
Andrew McCutchen,DH/LF,Brewers,,3354,457705,mccutan01,$1.44,134,515,122,25,,17,198,66,69,8,57,4,4,,.237,.316,,,,,,,,,,,,
Wilmer Flores,1B/2B/3B/DH,Giants,,2165,527038,florewi01,$1.34,151,525,120,28,1,19,207,72,71,,59,11,7,,.229,.316,,,,,,,,,,,,
Seth Brown,1B/DH/LF/RF,Athletics,,12982,664913,,$1.13,150,500,115,26,3,25,222,55,73,11,51,3,1,,.230,.305,,,,,,,,,,,,
Harold Ramírez,1B/CF/DH/LF/RF,Rays,,10104,623912,,$1.00,120,403,121,24,,6,163,46,58,3,19,9,4,,.300,.343,,,,,,,,,,,,
Rowdy Tellez,1B,Brewers,,11095,642133,,$1.00,153,529,116,23,,35,244,67,89,2,62,5,3,,.219,.306,,,,,,,,,,,,
Christian Bethancourt,1B/C,Athletics,,5132,542194,bethach01,$1.00,100,318,80,17,,11,130,39,34,5,12,2,,1,.252,.282,,,,,,,,,,,,
Tyler Stephenson,1B/C,Reds,,12469,663886,,$1.00,50,166,53,9,,6,80,24,35,1,12,3,2,,.319,.372,,,,,,,,,,,,
Gary Sánchez,C/DH,Twins,,5642,596142,,$1.00,128,419,86,24,,16,158,42,61,2,40,7,5,,.205,.282,,,,,,,,,,,,
Yuli Gurriel,1B,Astros,,11531,493329,,$0.00,146,545,132,40,,8,196,53,53,8,30,6,3,,.242,.288,,,,,,,,,,,,
Eric Hosmer,1B,Padres,,5082,543333,hosmeer01,$0.00,104,380,102,19,,8,145,38,44,,37,1,1,,.268,.334,,,,,,,,,,,,
Ji Man Choi,1B,Rays,,7377,596847,,$0.00,113,356,83,22,,11,138,36,52,,58,2,3,,.233,.341,,,,,,,,,,,,
Jared Walsh,1B,Angels,,12408,665120,,$-3.35,118,423,91,18,2,15,158,41,44,2,27,4,,,.215,.269,,,,,,,,,,,,
Max Muncy,1B/2B/3B/DH,Dodgers,,9385,571970,,$-3.63,136,464,91,22,1,21,178,69,69,2,90,5,6,,.196,.329,,,,,,,,,,,,
Albert Pujols,1B/DH,Cardinals,,3503,405395,pujolal01,$-4.23,109,307,83,14,,24,169,42,68,1,28,10,6,,.270,.345,,,,,,,,,,,,
Alfonso Rivas,1B,Cubs,,12707,663845,,$-4.40,101,251,59,5,2,3,77,27,25,6,29,4,2,1,.235,.321,,,,,,,,,,,,
Joey Votto,1B,Reds,,2825,458015,vottojo01,$-4.69,91,322,66,18,1,11,119,31,41,,44,10,,,.205,.319,,,,,,,,,,,,
Trey Mancini,1B/DH/LF,Orioles,,9387,641820,,$-5.71,143,519,124,23,1,18,203,56,63,,53,10,5,,.239,.319,,,,,,,,,,,,
Eloy Jiménez,DH/LF,White Sox,,11672,650391,,$-6.27,84,292,86,12,,16,146,40,54,,28,3,4,,.295,.358,,,,,,,,,,,,
Daniel Vogelbach,1B/DH,Pirates,,6495,596129,,$-6.36,130,386,92,19,1,18,167,47,59,,73,1,1,,.238,.360,,,,,,,,,,,,
Austin Barnes,C/DH,Dodgers,,6547,605131,,$-7.09,62,179,38,6,,8,68,31,26,2,27,3,1,2,.212,.321,,,,,,,,,,,,
Luke Voit,1B/DH,Padres,,11475,572228,,$-7.40,135,500,113,22,,22,201,55,69,1,55,7,6,,.226,.308,,,,,,,,,,,,
Byron Buxton,CF/DH,Twins,,6314,621439,,$-7.52,92,340,76,13,3,28,179,61,51,6,34,7,1,,.224,.306,,,,,,,,,,,,
Owen Miller,1B/2B/DH,Guardians,,12638,680911,,$-7.87,130,424,103,26,1,6,149,53,51,2,32,7,9,,.243,.301,,,,,,,,,,,,
Brandon Belt,1B,Giants,,4113,474832,beltbr01,$-8.44,78,254,54,9,1,8,89,25,23,1,37,6,1,,.213,.326,,,,,,,,,,,,
Nelson Cruz,1B/DH,Nationals,,4516,443558,cruzne02,$-8.46,124,448,105,16,,10,151,50,64,4,49,4,3,,.234,.313,,,,,,,,,,,,
Jace Peterson,1B/2B/3B/DH/OF,Brewers,,5789,607054,,$-8.50,112,288,68,14,2,8,110,44,34,12,33,2,3,2,.236,.314,,,,,,,,,,,,
P.J. Higgins,1B/C,Cubs,,12562,,,$-8.51,74,201,46,11,1,6,77,23,30,,22,2,1,3,.229,.306,,,,,,,,,,,,
Harold Castro,1B/2B/3B/SS,Tigers,,10681,605612,,$-8.52,120,420,114,21,2,7,160,37,47,,17,1,2,3,.271,.298,,,,,,,,,,,,
Garrett Cooper,1B/DH/RF,Marlins,,9475,643265,,$-8.74,119,414,108,33,2,9,172,37,50,,40,10,5,,.261,.337,,,,,,,,,,,,
Josh Donaldson,3B/DH,Yankees,,4806,518626,donaljo02,$-9.14,132,478,106,28,,15,179,59,62,2,54,8,6,,.222,.308,,,,,,,,,,,,
Spencer Torkelson,1B,Tigers,,13556,679529,,$-9.25,110,360,73,16,1,8,115,38,28,,37,5,2,,.203,.285,,,,,,,,,,,,
Andrew Knizner,C/DH,Cardinals,,12229,668800,,$-9.76,96,260,56,10,,4,78,28,25,,26,6,,1,.215,.300,,,,,,,,,,,,
Giancarlo Stanton,DH/RF,Yankees,,4949,519317,stantmi03,$-9.82,110,398,84,7,,31,184,53,78,,50,,3,,.211,.297,,,,,,,,,,,,
Connor Joe,1B/DH/LF,Rockies,,11834,656582,,$-10.15,111,404,96,20,4,7,145,56,28,6,55,7,1,,.238,.338,,,,,,,,,,,,
Mitch Garver,C/DH,Rangers,,10542,641598,,$-10.16,54,188,39,7,,10,76,23,24,1,23,2,2,,.207,.298,,,,,,,,,,,,
Joey Meneses,1B/RF,Nationals,,11251,608841,,$-11.06,56,222,72,14,,13,125,33,34,1,15,1,2,,.324,.367,,,,,,,,,,,,
Rafael Ortega,CF/DH,Cubs,,6151,542364,ortegra01,$-11.79,118,316,76,14,1,7,113,35,35,12,44,2,7,1,.241,.330,,,,,,,,,,,,
Yasmani Grandal,C/DH,White Sox,,4985,518735,grandya01,$-12.41,99,327,66,7,,5,88,15,27,1,45,2,2,,.202,.301,,,,,,,,,,,,
Ben Gamel,CF/DH/LF/RF,Pirates,,5946,592325,,$-12.42,115,371,86,20,2,9,137,42,46,5,48,3,1,,.232,.324,,,,,,,,,,,,
Hunter Dozier,1B/3B/DH/RF,Royals,,10142,641531,,$-12.54,128,462,109,26,4,12,179,51,41,4,34,3,1,,.236,.292,,,,,,,,,,,,
Marcell Ozuna,DH/LF,Braves,,4946,542303,ozunama01,$-12.54,124,470,106,19,,23,194,56,56,2,31,2,4,,.226,.274,,,,,,,,,,,,
J.D. Davis,3B/DH,Mets,,10929,605204,,$-13.40,115,318,79,16,1,12,133,46,35,1,39,6,2,,.248,.340,,,,,,,,,,,,
Shea Langeliers,C/DH,Athletics,,13068,669127,,$-13.45,40,142,31,10,1,6,61,14,22,,9,,2,,.218,.261,,,,,,,,,,,,
Colin Moran,1B,Reds,,7393,592567,,$-13.91,42,109,23,3,,5,41,11,23,,16,,3,,.211,.305,,,,,,,,,,,,
Carlos Santana,1B/DH,Royals,,1047,467793,santaca01,$-14.01,131,431,87,18,,19,162,52,60,,71,2,2,,.202,.316,,,,,,,,,,,,
Vinnie Pasquantino,1B/DH,Royals,,14036,686469,,$-14.08,72,258,76,10,,10,116,25,26,1,35,3,2,,.295,.383,,,,,,,,,,,,
Isaac Paredes,1B/2B/3B,Rays,,12184,670623,,$-14.18,111,331,68,16,,20,144,48,45,,44,4,2,,.205,.304,,,,,,,,,,,,
Luis Torrens,C/DH,Mariners,,11613,620443,,$-14.92,55,151,34,2,,3,45,13,15,,12,1,2,,.225,.283,,,,,,,,,,,,
Nick Pratto,1B,Royals,,12766,668472,,$-15.08,49,158,29,9,1,7,61,18,20,,19,1,3,1,.184,.269,,,,,,,,,,,,
Michael Chavis,1B/2B/3B/DH,Pirates,,12321,656308,,$-15.10,129,401,92,16,3,14,156,39,49,1,19,2,4,,.229,.265,,,,,,,,,,,,
Donovan Solano,1B/2B/DH,Reds,,3516,456781,solando01,$-15.40,80,278,79,16,,4,107,22,24,,19,5,2,,.284,.339,,,,,,,,,,,,
Gavin Sheets,DH/RF,White Sox,,13159,657757,,$-15.59,124,377,91,19,,15,155,34,53,,27,3,3,,.241,.295,,,,,,,,,,,,
Aledmys Díaz,1B/2B/3B/LF,Astros,,9486,649557,,$-15.76,92,305,74,13,,12,123,35,38,1,18,2,2,,.243,.287,,,,,,,,,,,,
Matt Vierling,3B/CF/DH/LF/RF,Phillies,,12605,663837,,$-15.78,117,325,80,12,2,6,114,41,32,7,23,3,6,,.246,.297,,,,,,,,,,,,
Jesús Aguilar,1B/DH,Marlins,,6259,542583,,$-15.83,129,464,109,19,,16,176,39,51,1,28,4,5,,.235,.281,,,,,,,,,,,,
Michael Toglia,1B,Rockies,,13602,669911,,$-15.89,31,111,24,8,2,2,42,10,12,1,9,,,,.216,.275,,,,,,,,,,,,
Michael Brantley,DH/LF,Astros,,1094,488726,brantmi02,$-16.16,64,243,70,14,1,5,101,28,26,1,31,1,1,1,.288,.368,,,,,,,,,,,,
Yermín Mercedes,C/DH,Giants,,11953,606213,,$-16.26,31,73,17,5,,1,25,9,8,,9,1,,,.233,.325,,,,,,,,,,,,
Stephen Vogt,C/DH,Athletics,,632,519390,vogtst01,$-16.50,70,168,27,4,1,7,54,18,23,1,17,2,4,,.161,.241,,,,,,,,,,,,
Matt Thaiss,1B,Angels,,11644,642136,,$-16.55,29,69,15,1,,2,22,9,8,1,11,,1,,.217,.321,,,,,,,,,,,,
Wil Myers,1B/RF,Padres,,5206,571976,myerswi01,$-17.39,77,261,68,15,,7,104,29,41,2,21,1,3,,.261,.315,,,,,,,,,,,,
Miguel Cabrera,1B/DH,Tigers,,1210,408234,cabremi01,$-17.73,112,397,101,10,,5,126,25,43,1,28,3,5,,.254,.305,,,,,,,,,,,,
Darin Ruf,1B/DH/LF,Giants,,5415,573131,rufda01,$-17.85,118,334,68,12,,11,113,52,45,2,45,6,3,,.204,.307,,,,,,,,,,,,
Franmil Reyes,DH/RF,Guardians,,7603,614177,,$-18.46,118,438,97,17,2,14,160,43,47,2,30,2,3,,.221,.273,,,,,,,,,,,,
Keston Hiura,1B/DH,Brewers,,12056,669374,,$-18.73,80,234,53,8,1,14,105,34,32,5,23,8,1,,.226,.316,,,,,,,,,,,,
Riley Adams,1B/C,Nationals,,13138,656180,,$-18.98,48,142,25,4,,5,44,14,10,,12,1,,,.176,.245,,,,,,,,,,,,
Willians Astudillo,1B/3B/C,Marlins,,12114,553902,,$-19.15,21,54,13,,,1,16,5,4,1,1,,,,.241,.255,,,,,,,,,,,,
Cavan Biggio,1B/2B/3B,Blue Jays,,12260,624415,,$-19.23,97,257,52,18,1,6,90,43,24,2,38,6,1,1,.202,.317,,,,,,,,,,,,
Jared Young,1B,Cubs,,12565,,,$-19.29,6,19,5,2,,,7,2,,1,3,,,,.263,.364,,,,,,,,,,,,
Corey Dickerson,DH/LF,Cardinals,,6308,572816,dickeco01,$-19.30,96,281,75,17,1,6,112,28,36,,12,2,2,,.267,.300,,,,,,,,,,,,
Orlando Arcia,1B/2B,Braves,,6093,606115,,$-19.60,67,209,51,9,,9,87,25,30,,21,2,2,,.244,.316,,,,,,,,,,,,
Rob Refsnyder,1B/CF/LF/RF,Red Sox,,9551,608701,,$-19.85,57,153,47,11,,6,76,25,21,1,15,6,3,,.307,.384,,,,,,,,,,,,
Aramis Garcia,1B/C,Reds,,6680,605244,,$-20.03,47,108,23,2,,1,28,6,4,,3,2,,2,.213,.243,,,,,,,,,,,,
Lewin Díaz,1B,Marlins,,13015,650331,,$-20.11,58,160,27,4,,5,46,12,11,1,11,1,2,,.169,.224,,,,,,,,,,,,
Bobby Dalbec,1B/3B,Red Sox,,12431,666915,,$-20.53,117,317,68,9,2,12,117,40,39,3,29,3,4,,.215,.283,,,,,,,,,,,,
Matt Davidson,DH,Athletics,,5310,571602,davidma02,$-20.56,13,34,5,,,2,11,3,3,,3,,,,.147,.216,,,,,,,,,,,,
Ivan Castillo,DH,Royals,,11049,,,$-20.61,,,,,,,,,,,,,,,,,,,,,,,,,,,,
Gavin Conticello,DH,Diamondbacks,,14658,,,$-20.61,,,,,,,,,,,,,,,,,,,,,,,,,,,,
Khris Davis,DH,Free Agent,,5380,501981,daviskh01,$-20.61,,,,,,,,,,,,,,,,,,,,,,,,,,,,
Pedro Leon,DH,Astros,,13768,,,$-20.61,,,,,,,,,,,,,,,,,,,,,,,,,,,,
Braxton Martinez,DH,Angels,,13977,,,$-20.61,,,,,,,,,,,,,,,,,,,,,,,,,,,,
Mitch Moreland,DH,Free Agent,,4519,519048,morelmi01,$-20.61,,,,,,,,,,,,,,,,,,,,,,,,,,,,
Peter Zimmermann,DH,Astros,,14074,,,$-20.61,,,,,,,,,,,,,,,,,,,,,,,,,,,,
Jonathan Schoop,1B/2B,Tigers,,5830,570731,schoojo01,$-20.72,131,481,97,23,1,11,155,48,38,5,19,6,4,,.202,.239,,,,,,,,,,,,
Matt Adams,1B,Free Agent,,5355,571431,adamsma01,$-20.91,,,,,,,,,,,,,,,,,,,,,,,,,,,,
Luken Baker,1B,Cardinals,,12582,663609,,$-20.91,,,,,,,,,,,,,,,,,,,,,,,,,,,,
Bryce Ball,1B,Cubs,,13133,,,$-20.91,,,,,,,,,,,,,,,,,,,,,,,,,,,,
Will Bartlett,1B,Guardians,,14456,,,$-20.91,,,,,,,,,,,,,,,,,,,,,,,,,,,,
Luke Berryhill,1B,Astros,,14072,,,$-20.91,,,,,,,,,,,,,,,,,,,,,,,,,,,,
Justice Bigbie,1B,Tigers,,14757,,,$-20.91,,,,,,,,,,,,,,,,,,,,,,,,,,,,
Greg Bird,1B,Blue Jays,,6291,595885,,$-20.91,,,,,,,,,,,,,,,,,,,,,,,,,,,,
Jordan Brown,1B,Guardians,,1095,488740,brownjo05,$-20.91,,,,,,,,,,,,,,,,,,,,,,,,,,,,
Grayson Byrd,1B,Cubs,,13953,,,$-20.91,,,,,,,,,,,,,,,,,,,,,,,,,,,,
Pedro Castellanos,1B,Red Sox,,13205,,,$-20.91,,,,,,,,,,,,,,,,,,,,,,,,,,,,
Freddvil Chevez,1B,Rays,,14667,,,$-20.91,,,,,,,,,,,,,,,,,,,,,,,,,,,,
Jackson Coutts,1B,Nationals,,14635,,,$-20.91,,,,,,,,,,,,,,,,,,,,,,,,,,,,
Will Craig,1B,Free Agent,,12649,643269,,$-20.91,,,,,,,,,,,,,,,,,,,,,,,,,,,,
Blaine Crim,1B,Rangers,,14033,,,$-20.91,,,,,,,,,,,,,,,,,,,,,,,,,,,,
Andrew Daschbach,1B,Orioles,,14396,,,$-20.91,,,,,,,,,,,,,,,,,,,,,,,,,,,,
Landon Dieterich,1B,Nationals,,14693,,,$-20.91,,,,,,,,,,,,,,,,,,,,,,,,,,,,
Evan Edwards,1B,Rays,,13997,,,$-20.91,,,,,,,,,,,,,,,,,,,,,,,,,,,,
Jonathan Engelmann,1B,Guardians,,14315,,,$-20.91,,,,,,,,,,,,,,,,,,,,,,,,,,,,
J.C. Escarra,1B,Orioles,,7532,,,$-20.91,,,,,,,,,,,,,,,,,,,,,,,,,,,,
Chris Gittens,1B,Yankees,,11505,656467,,$-20.91,,,,,,,,,,,,,,,,,,,,,,,,,,,,
Zach Green,1B,Mariners,,12412,608339,,$-20.91,,,,,,,,,,,,,,,,,,,,,,,,,,,,
Jim Haley,1B,Rays,,12463,670113,,$-20.91,,,,,,,,,,,,,,,,,,,,,,,,,,,,
Tyler Hardman,1B,Yankees,,14243,,,$-20.91,,,,,,,,,,,,,,,,,,,,,,,,,,,,
John Hicks,1B/C,Cubs,,5729,543308,,$-20.91,,,,,,,,,,,,,,,,,,,,,,,,,,,,
Alex Holderbach,1B,Astros,,14166,,,$-20.91,,,,,,,,,,,,,,,,,,,,,,,,,,,,
Spencer Horwitz,1B,Blue Jays,,14010,687462,,$-20.91,,,,,,,,,,,,,,,,,,,,,,,,,,,,
Greyson Jenista,1B,Braves,,12383,,,$-20.91,,,,,,,,,,,,,,,,,,,,,,,,,,,,
Dalton Kelly,1B,Athletics,,12160,665138,,$-20.91,,,,,,,,,,,,,,,,,,,,,,,,,,,,
Nash Knight,1B,Rangers,,12872,,,$-20.91,,,,,,,,,,,,,,,,,,,,,,,,,,,,
Grant Lavigne,1B,Rockies,,14044,,,$-20.91,,,,,,,,,,,,,,,,,,,,,,,,,,,,
Quinton Low,1B,Brewers,,14724,,,$-20.91,,,,,,,,,,,,,,,,,,,,,,,,,,,,
Nelson Maldonado,1B,Cubs,,13930,,,$-20.91,,,,,,,,,,,,,,,,,,,,,,,,,,,,
Kyle Manzardo,1B,Rays,,14519,700932,,$-20.91,,,,,,,,,,,,,,,,,,,,,,,,,,,,
Ernesto Martinez,1B,Brewers,,14488,,,$-20.91,,,,,,,,,,,,,,,,,,,,,,,,,,,,
Paul McIntosh,1B,Marlins,,14377,,,$-20.91,,,,,,,,,,,,,,,,,,,,,,,,,,,,
Jake Means,1B,Royals,,14708,,,$-20.91,,,,,,,,,,,,,,,,,,,,,,,,,,,,
Ramon Mendoza,1B,Cardinals,,14695,,,$-20.91,,,,,,,,,,,,,,,,,,,,,,,,,,,,
Roy Morales,1B,Twins,,14512,,,$-20.91,,,,,,,,,,,,,,,,,,,,,,,,,,,,
J.D. Mundy,1B,Orioles,,14017,,,$-20.91,,,,,,,,,,,,,,,,,,,,,,,,,,,,
Joe Naranjo,1B,Guardians,,14218,,,$-20.91,,,,,,,,,,,,,,,,,,,,,,,,,,,,
Quincy Nieporte,1B,Tigers,,14611,,,$-20.91,,,,,,,,,,,,,,,,,,,,,,,,,,,,
John Nogowski,1B,Braves,,6591,596056,,$-20.91,,,,,,,,,,,,,,,,,,,,,,,,,,,,
Rainer Nunez,1B,Blue Jays,,14672,,,$-20.91,,,,,,,,,,,,,,,,,,,,,,,,,,,,
Josh Ockimey,1B,Phillies,,12251,656807,,$-20.91,,,,,,,,,,,,,,,,,,,,,,,,,,,,
Ernny Ordonez,1B,Pirates,,14588,,,$-20.91,,,,,,,,,,,,,,,,,,,,,,,,,,,,
Preston Palmeiro,1B,Angels,,12676,,,$-20.91,,,,,,,,,,,,,,,,,,,,,,,,,,,,
Yassel Pino,1B,Reds,,14786,,,$-20.91,,,,,,,,,,,,,,,,,,,,,,,,,,,,
Micah Pries,1B,Guardians,,14132,,,$-20.91,,,,,,,,,,,,,,,,,,,,,,,,,,,,
Nick Ramirez,1B,Free Agent,,5714,598286,,$-20.91,,,,,,,,,,,,,,,,,,,,,,,,,,,,
Roberto Ramos,1B,Red Sox,,12936,,,$-20.91,,,,,,,,,,,,,,,,,,,,,,,,,,,,
Tyreque Reed,1B,Red Sox,,12896,,,$-20.91,,,,,,,,,,,,,,,,,,,,,,,,,,,,
Aderlin Rodriguez,1B,Padres,,5410,573669,,$-20.91,,,,,,,,,,,,,,,,,,,,,,,,,,,,
Aaron Sabato,1B,Twins,,13696,,,$-20.91,,,,,,,,,,,,,,,,,,,,,,,,,,,,
Danyer Sanabria,1B,Diamondbacks,,14720,,,$-20.91,,,,,,,,,,,,,,,,,,,,,,,,,,,,
David Sheaffer,1B,Mariners,,14642,,,$-20.91,,,,,,,,,,,,,,,,,,,,,,,,,,,,
Jon Singleton,1B,Brewers,,5593,572138,,$-20.91,,,,,,,,,,,,,,,,,,,,,,,,,,,,
Madison Stokes,1B,Phillies,,14003,,,$-20.91,,,,,,,,,,,,,,,,,,,,,,,,,,,,
LJ Talley,1B,Blue Jays,,14306,,,$-20.91,,,,,,,,,,,,,,,,,,,,,,,,,,,,
Dillon Tatum,1B,Twins,,14739,,,$-20.91,,,,,,,,,,,,,,,,,,,,,,,,,,,,
Robbie Tenerowicz,1B,Reds,,12737,,,$-20.91,,,,,,,,,,,,,,,,,,,,,,,,,,,,
Curtis Terry,1B,Twins,,13055,,,$-20.91,,,,,,,,,,,,,,,,,,,,,,,,,,,,
Jacob Teter,1B,Orioles,,14357,,,$-20.91,,,,,,,,,,,,,,,,,,,,,,,,,,,,
Jeremy Vasquez,1B,Mets,,12008,657075,,$-20.91,,,,,,,,,,,,,,,,,,,,,,,,,,,,
Eric Wagaman,1B,Yankees,,14176,,,$-20.91,,,,,,,,,,,,,,,,,,,,,,,,,,,,
Evan White,1B,Mariners,,11987,657108,,$-20.91,,,,,,,,,,,,,,,,,,,,,,,,,,,,
Tyler White,1B,Brewers,,11363,643603,,$-20.91,,,,,,,,,,,,,,,,,,,,,,,,,,,,
Weston Wilson,1B,Brewers,,12060,642215,,$-20.91,,,,,,,,,,,,,,,,,,,,,,,,,,,,
Garrett Wolforth,1B,Reds,,14577,,,$-20.91,,,,,,,,,,,,,,,,,,,,,,,,,,,,
Cole Zabowski,1B,Rockies,,14646,,,$-20.91,,,,,,,,,,,,,,,,,,,,,,,,,,,,
Zach Zubia,1B,Marlins,,14633,,,$-20.91,,,,,,,,,,,,,,,,,,,,,,,,,,,,
Taylor Jones,1B,Giants,,12012,622100,,$-21.04,1,1,,,,,,,,,,,,,,,,,,,,,,,,,,
Dom Nuñez,C/DH,Rockies,,12934,,,$-21.15,14,33,4,1,,,5,3,2,,6,,2,,.121,.244,,,,,,,,,,,,
Mitch Haniger,DH/RF,Mariners,,6881,571745,,$-21.30,57,224,55,8,,11,96,31,34,,20,1,2,,.246,.308,,,,,,,,,,,,
Franchy Cordero,1B/LF/RF,Red Sox,,7602,614173,,$-21.45,84,242,53,17,1,8,96,36,29,4,28,1,2,2,.219,.298,,,,,,,,,,,,
David MacKinnon,1B,Athletics,,12743,676950,,$-21.52,22,50,7,,,,7,2,6,,6,,1,,.140,.228,,,,,,,,,,,,
Josh Lester,1B,Tigers,,12490,623507,,$-21.56,2,5,,,,,,,,,,,,,,,,,,,,,,,,,,
Ronald Guzmán,1B,Yankees,,10050,608597,,$-21.68,3,6,,,,,,,,,,,,,,,,,,,,,,,,,,
Juan Yepez,1B/LF,Cardinals,,13865,,,$-21.79,76,253,64,13,,12,113,27,30,,16,1,4,,.253,.296,,,,,,,,,,,,
Mike Brosseau,2B/3B/DH,Brewers,,12445,670712,,$-21.79,69,141,36,5,,6,59,15,23,2,14,5,,,.255,.344,,,,,,,,,,,,
Bobby Bradley,1B,Guardians,,11714,656252,,$-21.87,8,17,2,,,,2,1,,,,,,,.118,.118,,,,,,,,,,,,
Miguel Sanó,1B,Twins,,6302,593934,,$-23.31,20,60,5,,,1,8,1,3,1,9,1,1,,.083,.211,,,,,,,,,,,,
Maikel Franco,3B/DH,Nationals,,7402,596748,,$-23.78,103,371,85,15,,9,127,31,39,1,12,2,3,,.229,.255,,,,,,,,,,,,
Kole Calhoun,DH/LF/RF,Rangers,,5340,594777,calhoko01,$-24.01,125,388,76,14,1,12,128,36,49,3,27,6,3,,.196,.257,,,,,,,,,,,,
Jorge Soler,DH/LF/RF,Marlins,,6129,624585,,$-24.10,72,270,56,13,,13,108,32,34,,31,3,1,,.207,.295,,,,,,,,,,,,
Pavin Smith,1B/CF/DH/LF/RF,Diamondbacks,,12692,656976,,$-24.62,75,245,54,9,,9,90,24,33,1,28,1,3,,.220,.300,,,,,,,,,,,,
Matt Duffy,1B/2B/3B,Angels,,10023,622110,,$-24.77,77,228,57,8,,2,71,14,16,,17,2,,,.250,.308,,,,,,,,,,,,
Frank Schwindel,1B/DH,Cubs,,11162,643524,,$-25.24,75,271,62,11,,8,97,23,36,,19,,2,,.229,.277,,,,,,,,,,,,
Abraham Toro,2B/3B/DH,Mariners,,12206,647351,,$-25.30,109,324,60,13,1,10,105,36,35,2,22,2,4,,.185,.239,,,,,,,,,,,,
Mike Moustakas,1B/3B/DH,Reds,,1398,519058,moustmi01,$-25.38,78,252,54,12,,7,87,30,25,2,24,6,3,,.214,.295,,,,,,,,,,,,
LaMonte Wade,1B/LF/RF,Giants,,11994,664774,,$-26.08,77,217,45,7,1,8,78,29,26,1,26,5,1,2,.207,.303,,,,,,,,,,,,
Brad Miller,1B/3B/DH/LF,Rangers,,5680,543543,millebr02,$-26.64,81,222,47,3,,7,71,20,32,4,18,,1,,.212,.270,,,,,,,,,,,,
Tommy La Stella,2B/DH,Giants,,5693,600303,,$-26.67,60,180,43,14,,2,63,17,14,,11,1,3,,.239,.282,,,,,,,,,,,,
Yu Chang,1B/2B/3B,Guardians,,10827,644374,,$-27.87,69,168,35,6,,4,53,19,15,,16,4,2,,.208,.289,,,,,,,,,,,,
Marwin Gonzalez,1B/2B/3B/RF/SS,Yankees,,2731,503556,gonzama01,$-28.20,85,184,34,7,,6,59,20,18,3,14,4,2,3,.185,.251,,,,,,,,,,,,
Darick Hall,1B/DH,Phillies,,12246,669742,,$-28.38,41,136,34,8,1,9,71,19,16,,5,1,,,.250,.282,,,,,,,,,,,,
Sean Bouchard,1B/LF,Rockies,,13287,656248,,$-28.51,27,74,22,6,,3,37,9,11,,21,1,1,,.297,.454,,,,,,,,,,,,
Josh VanMeter,1B/2B/3B,Pirates,,7597,642165,,$-28.65,67,171,32,5,2,3,50,15,14,4,19,,2,,.187,.266,,,,,,,,,,,,
Alex Kirilloff,1B/DH/LF/RF,Twins,,12619,666135,,$-29.26,45,144,36,7,,3,52,14,21,,5,4,2,,.250,.290,,,,,,,,,,,,
Edwin Ríos,1B/3B/DH,Dodgers,,7531,621458,,$-30.75,27,86,21,1,,7,43,12,17,,5,1,,,.244,.293,,,,,,,,,,,,
Austin Meadows,DH/LF,Tigers,,7454,640457,,$-30.76,36,128,32,6,2,,42,9,11,,16,3,,,.250,.347,,,,,,,,,,,,
Greg Allen,DH/LF,Pirates,,11050,656185,,$-30.79,46,118,22,4,,2,32,17,8,8,10,2,1,3,.186,.254,,,,,,,,,,,,
Ryan O'Hearn,1B/DH/RF,Royals,,11624,656811,,$-31.05,67,134,32,6,1,1,43,14,16,,8,2,1,,.239,.290,,,,,,,,,,,,
Jed Lowrie,2B/3B/DH,Athletics,,145,476704,lowrije01,$-31.44,50,167,30,5,,3,44,14,16,1,15,,2,,.180,.245,,,,,,,,,,,,
Skye Bolt,1B/CF,Athletics,,12209,621450,,$-31.73,42,106,21,2,,4,35,10,13,5,7,2,1,,.198,.259,,,,,,,,,,,,
Triston Casas,1B/3B,Red Sox,,13477,671213,,$-31.74,27,76,15,1,,5,31,11,12,1,19,,,,.197,.358,,,,,,,,,,,,
Dérmis Garcia,1B/3B,Athletics,,12492,,,$-31.99,39,116,24,6,,5,45,13,20,,8,1,,,.207,.264,,,,,,,,,,,,