Player,Position,ProTeam,RotoTeam,RVid,MLBAMID,BDBID,RotoValue,pG,pIP,pH,pHR,pK,pBB,pIBB,pHB,pER,pWin,pL,pSav,pWHIP,pERA,pFIP,bG,bAB,bH,b2B,b3B,bHR,bRBOE,bR,bRBI,bSB,bCS,bBB,bIBB,bHBP,bSF,bSH,bAvg,bOBP,bSlg,bwOBA
Freddie Freeman,1B,Braves,,1836,518692,freemfr01,$26.83,,,,,,,,,,,,,,,,162,618,191,44,4,23,6,94,98,10,3,76,12,7,6,,.309,.388,.505,.391
Ozzie Albies,2B,Braves,,11728,645277,,$18.54,,,,,,,,,,,,,,,,158,639,167,40,5,24,7,105,72,14,3,36,,5,3,1,.261,.304,.452,.339
Ronald Acuña,CF/LF,Braves,,11729,660670,,$17.30,,,,,,,,,,,,,,,,111,433,127,26,4,26,2,78,64,16,5,45,2,6,3,,.293,.366,.552,.397
Ender Inciarte,CF,Braves,,5315,542255,,$13.17,,,,,,,,,,,,,,,,156,597,158,27,6,10,3,83,61,28,14,49,1,6,4,4,.265,.323,.380,.317
Nick Markakis,RF,Braves,,494,455976,markani01,$11.24,,,,,,,,,,,,,,,,162,623,185,43,2,14,4,78,93,1,1,72,10,1,9,,.297,.366,.440,.354
Kurt Suzuki,C,Braves,,4816,435559,suzukku01,$5.60,,,,,,,,,,,,,,,,105,347,94,24,,12,2,45,50,,,22,,13,6,,.271,.332,.444,.341
Johan Camargo,3B/SS,Braves,,10256,622666,,$2.43,,,,,,,,,,,,,,,,134,464,126,27,1,19,5,63,76,1,1,51,4,6,3,,.272,.349,.457,.357
Dansby Swanson,SS,Braves,,11537,621020,,$-3.76,,,,,,,,,,,,,,,,136,478,114,25,4,14,7,51,59,10,4,44,15,2,3,6,.238,.300,.395,.309
Tyler Flowers,C,Braves,,4971,452095,flowety01,$-4.28,,,,,,,,,,,,,,,,82,251,57,9,,8,1,34,30,,,35,,9,1,,.227,.341,.359,.321
Charlie Culberson,2B/3B/LF/SS,Braves,,5064,518586,culbech01,$-10.49,,,,,,,,,,,,,,,,113,296,80,18,2,12,5,47,45,4,2,21,5,4,1,,.270,.326,.466,.351
Chris Stewart,C,Braves,,3952,455755,stewach01,$-17.93,,,,,,,,,,,,,,,,8,15,3,,,,,3,3,,,1,,,1,,.200,.235,.200,.200
Rob Brantly,C,Braves,,5093,542963,brantro01,$-18.85,,,,,,,,,,,,,,,,,,,,,,,,,,,,,,,,,,,
Jonathan Morales,C,Braves,,11730,664966,,$-18.85,,,,,,,,,,,,,,,,,,,,,,,,,,,,,,,,,,,
Kade Scivicque,C,Braves,,12063,664767,,$-18.85,,,,,,,,,,,,,,,,,,,,,,,,,,,,,,,,,,,
Preston Tucker,LF,Braves,,7005,605512,,$-24.83,,,,,,,,,,,,,,,,97,166,38,11,,6,2,19,27,,,13,,4,1,,.229,.299,.404,.317
Ryan Flaherty,3B,Braves,,2676,475247,flahery01,$-28.46,,,,,,,,,,,,,,,,81,161,35,6,,2,,17,13,4,2,18,4,1,1,1,.217,.297,.292,.262
Lane Adams,LF,Braves,,6849,572669,,$-31.07,,,,,,,,,,,,,,,,26,25,6,1,,2,1,10,6,1,,4,,,,,.240,.345,.520,.410
Peter Bourjos,CF/LF,Braves,,1703,488721,bourjpe01,$-34.39,,,,,,,,,,,,,,,,36,44,9,2,1,1,1,5,4,,,2,,,,1,.205,.234,.364,.280
Phil Gosselin,2B,Braves,,5245,594838,gosseph01,$-34.61,,,,,,,,,,,,,,,,20,24,3,,,1,,5,2,,,4,1,,,,.125,.250,.250,.219
Danny Santana,CF/LF,Braves,,5347,542454,,$-34.92,,,,,,,,,,,,,,,,15,28,5,3,,,,4,2,1,1,3,,1,,,.179,.281,.286,.253
Xavier Avery,CF,Braves,,481,542897,averyxa01,$-35.61,,,,,,,,,,,,,,,,,,,,,,,,,,,,,,,,,,,
Emilio Bonifácio,2B,Braves,,1986,466988,bonifem01,$-35.61,,,,,,,,,,,,,,,,,,,,,,,,,,,,,,,,,,,
Jaff Decker,LF,Braves,,5453,543094,deckeja01,$-35.61,,,,,,,,,,,,,,,,,,,,,,,,,,,,,,,,,,,
Ray-Patrick Didder,CF,Braves,,12064,642720,,$-35.61,,,,,,,,,,,,,,,,,,,,,,,,,,,,,,,,,,,
Stephen Gaylor,CF,Braves,,12178,641603,,$-35.61,,,,,,,,,,,,,,,,,,,,,,,,,,,,,,,,,,,
Sean Kazmar Jr.,SS,Braves,,3985,453527,kazmase01,$-35.61,,,,,,,,,,,,,,,,,,,,,,,,,,,,,,,,,,,
Alay Lago,2B,Braves,,11981,667605,,$-35.61,,,,,,,,,,,,,,,,,,,,,,,,,,,,,,,,,,,
Cristian Pache,CF,Braves,,12062,665506,,$-35.61,,,,,,,,,,,,,,,,,,,,,,,,,,,,,,,,,,,
Cleuluis Rondon,SS,Braves,,9414,600967,,$-35.61,,,,,,,,,,,,,,,,,,,,,,,,,,,,,,,,,,,
Tyler Smith,SS,Braves,,9368,642094,,$-35.61,,,,,,,,,,,,,,,,,,,,,,,,,,,,,,,,,,,
Christian Colón,2B/SS,Braves,,5201,518568,,$-35.82,,,,,,,,,,,,,,,,,,,,,,,,,,,,,,,,,,,
Adonis Garcia,3B,Braves,,6292,611177,,$-35.85,,,,,,,,,,,,,,,,,,,,,,,,,,,,,,,,,,,
Austin Riley,3B,Braves,,11974,663586,,$-35.85,,,,,,,,,,,,,,,,,,,,,,,,,,,,,,,,,,,
Alex Jackson,RF,Braves,,10634,656577,,$-36.04,,,,,,,,,,,,,,,,,,,,,,,,,,,,,,,,,,,
Carlos Franco,1B,Braves,,11975,554238,,$-36.99,,,,,,,,,,,,,,,,,,,,,,,,,,,,,,,,,,,
Michael Snyder,1B,Braves,,11153,621551,,$-36.99,,,,,,,,,,,,,,,,,,,,,,,,,,,,,,,,,,,
