Player,Position,ProTeam,RotoTeam,RVid,pG,pIP,pH,pHR,pK,pBB,pIBB,pHB,pR,pER,pWin,pL,pSav,pHld,pS+H,pQS,pWHIP,pERA,pR/9,pFIP,bG,bAB,bH,b2B,b3B,bHR,bRBOE,bTB,bR,bRBI,bSB,bCS,bBB,bIBB,bHBP,bSF,bSH,bAvg,bOBP,bSlg,bwOBA
Reggie Abercrombie,CF,Astros,,3000,,,,,,,,,,,,,,,,,,,,,,,,,,,,,,,,,,,,,,,,,
Abraham Almonte,CF,Mariners,,318,,,,,,,,,,,,,,,,,,,,,25,72,19,4,,2,,29,10,9,1,,6,,,2,2,.264,.305,.403,.314
Erold Andrus,CF,Rangers,,611,,,,,,,,,,,,,,,,,,,,,,,,,,,,,,,,,,,,,,,,,
Rick Ankiel,CF,Mets,,1414,,,,,,,,,,,,,,,,,,,,,46,132,24,7,1,7,,54,13,18,,1,9,,,,,.182,.234,.409,.271
Tyson Auer,CF,Angels,,1702,,,,,,,,,,,,,,,,,,,,,,,,,,,,,,,,,,,,,,,,,
Jarred Ball,CF,Diamondbacks,,3679,,,,,,,,,,,,,,,,,,,,,,,,,,,,,,,,,,,,,,,,,
Brandon Barnes,CF,Astros,,3009,,,,,,,,,,,,,,,,,,,,,136,408,97,17,1,8,,140,46,41,11,11,21,,8,2,6,.238,.283,.343,.274
Engel Beltre,CF,Rangers,,4493,,,,,,,,,,,,,,,,,,,,,22,40,10,1,,,,11,7,2,1,2,,,1,,1,.250,.262,.275,.227
Jairo Beras,CF,Rangers,,5658,,,,,,,,,,,,,,,,,,,,,,,,,,,,,,,,,,,,,,,,,
Roger Bernadina,CF,Phillies,,2549,,,,,,,,,,,,,,,,,,,,,112,227,41,10,2,4,,67,26,11,4,,16,1,5,,2,.181,.248,.295,.248
Dustin Biell,CF,Rays,,593,,,,,,,,,,,,,,,,,,,,,,,,,,,,,,,,,,,,,,,,,
Charlie Blackmon,CF,Rockies,,5147,,,,,,,,,,,,,,,,,,,,,82,246,76,17,2,6,,115,35,22,7,,7,,3,,2,.309,.333,.467,.356
Julio Borbon,CF,Cubs,,4494,,,,,,,,,,,,,,,,,,,,,73,105,21,3,1,1,,29,11,3,7,1,12,,,,1,.200,.280,.276,.268
Smaily Borgues,CF,Cubs,,2681,,,,,,,,,,,,,,,,,,,,,,,,,,,,,,,,,,,,,,,,,
Jason Bourgeois,CF,Rays,,3010,,,,,,,,,,,,,,,,,,,,,9,16,3,,,1,,6,2,2,,,2,,,,,.188,.278,.375,.289
Peter Bourjos,CF,Angels,,1703,,,,,,,,,,,,,,,,,,,,,55,175,49,3,3,3,,67,26,12,6,,10,,6,1,4,.280,.332,.383,.329
Michael Bourn,CF,Indians,,3001,,,,,,,,,,,,,,,,,,,,,130,525,138,21,6,6,,189,75,51,23,12,40,,2,3,5,.263,.313,.360,.301
Jackie Bradley Jr.,CF,Red Sox,,5843,,,,,,,,,,,,,,,,,,,,,37,95,18,5,,3,,32,18,10,2,,10,,2,,,.189,.280,.337,.282
Adrian Brown,CF,Rangers,,4495,,,,,,,,,,,,,,,,,,,,,,,,,,,,,,,,,,,,,,,,,
Corey Brown,CF,Nationals,,4848,,,,,,,,,,,,,,,,,,,,,14,12,2,1,,1,,6,2,1,1,,3,,,,,.167,.333,.500,.373
Steve Brown,CF,Astros,,3002,,,,,,,,,,,,,,,,,,,,,,,,,,,,,,,,,,,,,,,,,
Steve Bumbry,CF,Orioles,,5286,,,,,,,,,,,,,,,,,,,,,,,,,,,,,,,,,,,,,,,,,
Jarrett Burgess,CF,Mariners,,6046,,,,,,,,,,,,,,,,,,,,,,,,,,,,,,,,,,,,,,,,,
Greg Burns,CF,Marlins,,2002,,,,,,,,,,,,,,,,,,,,,,,,,,,,,,,,,,,,,,,,,
Marlon Byrd,CF,Pirates,,2682,,,,,,,,,,,,,,,,,,,,,147,532,155,35,5,24,,272,75,88,2,4,31,2,8,7,1,.291,.335,.511,.358
Willie Cabrera,CF,Braves,,1862,,,,,,,,,,,,,,,,,,,,,,,,,,,,,,,,,,,,,,,,,
Lorenzo Cain,CF,Royals,,3160,,,,,,,,,,,,,,,,,,,,,115,399,100,21,3,4,,139,54,46,14,6,33,2,4,6,,.251,.310,.348,.293
Joel Caminero,CF,Rays,,5885,,,,,,,,,,,,,,,,,,,,,,,,,,,,,,,,,,,,,,,,,
Matt Camp,CF,Cubs,,2683,,,,,,,,,,,,,,,,,,,,,,,,,,,,,,,,,,,,,,,,,
Tony Campana,CF,Diamondbacks,,2684,,,,,,,,,,,,,,,,,,,,,29,46,12,,1,,,14,10,,8,2,8,,,,,.261,.370,.304,.335
Ezequiel Carrera,CF,Indians,,4331,,,,,,,,,,,,,,,,,,,,,15,17,3,,,,,3,3,1,,,1,,2,,1,.176,.286,.176,.240
Daniel Carte,CF,Rockies,,3826,,,,,,,,,,,,,,,,,,,,,,,,,,,,,,,,,,,,,,,,,
Yefri Carvajal,CF,Padres,,4887,,,,,,,,,,,,,,,,,,,,,,,,,,,,,,,,,,,,,,,,,
Adron Chambers,CF,Cardinals,,3523,,,,,,,,,,,,,,,,,,,,,25,26,4,1,,,,5,5,1,,1,3,2,,,,.154,.241,.192,.154
Shin-Soo Choo,CF,Reds,,1109,,,,,,,,,,,,,,,,,,,,,154,569,162,34,2,21,,263,107,54,20,11,112,5,26,2,3,.285,.421,.462,.390
Larry Cobb,CF,Athletics,,4849,,,,,,,,,,,,,,,,,,,,,,,,,,,,,,,,,,,,,,,,,
Jason Codiroli,CF,Padres,,3994,,,,,,,,,,,,,,,,,,,,,,,,,,,,,,,,,,,,,,,,,
Michael Coleman,CF,Rays,,594,,,,,,,,,,,,,,,,,,,,,,,,,,,,,,,,,,,,,,,,,
Kyle Colligan,CF,White Sox,,925,,,,,,,,,,,,,,,,,,,,,,,,,,,,,,,,,,,,,,,,,
Jose Constanza,CF,Braves,,1103,,,,,,,,,,,,,,,,,,,,,21,31,8,,,,,8,2,3,,3,,,,,,.258,.258,.258,.184
Ruben Contreras,CF,Rays,,595,,,,,,,,,,,,,,,,,,,,,,,,,,,,,,,,,,,,,,,,,
Brad Coon,CF,Rays,,1704,,,,,,,,,,,,,,,,,,,,,,,,,,,,,,,,,,,,,,,,,
Ben Copeland,CF,Indians,,4170,,,,,,,,,,,,,,,,,,,,,,,,,,,,,,,,,,,,,,,,,
Collin Cowgill,CF,Angels,,3704,,,,,,,,,,,,,,,,,,,,,73,152,32,5,2,4,,53,18,16,1,,7,,,,3,.211,.241,.349,.261
Casey Craig,CF,Phillies,,2352,,,,,,,,,,,,,,,,,,,,,,,,,,,,,,,,,,,,,,,,,
Evan Crawford,CF,Cubs,,5324,,,,,,,,,,,,,,,,,,,,,,,,,,,,,,,,,,,,,,,,,
Coco Crisp,CF,Athletics,,4850,,,,,,,,,,,,,,,,,,,,,131,513,134,22,3,22,,228,93,66,21,5,61,3,,8,2,.261,.334,.444,.342
Trevor Crowe,CF,Astros,,1096,,,,,,,,,,,,,,,,,,,,,60,165,36,7,1,1,,48,18,13,6,1,16,,,,,.218,.287,.291,.270
Todd Cunningham,CF,Braves,,5247,,,,,,,,,,,,,,,,,,,,,8,8,2,,,,,2,2,,,,,,,,,.250,.250,.250,.225
Mike Curry,CF,Rays,,596,,,,,,,,,,,,,,,,,,,,,,,,,,,,,,,,,,,,,,,,,
Jeff DaVanon,CF,White Sox,,927,,,,,,,,,,,,,,,,,,,,,,,,,,,,,,,,,,,,,,,,,
Jordan Danks,CF,White Sox,,926,,,,,,,,,,,,,,,,,,,,,79,160,37,7,,5,,59,15,12,7,2,18,,1,,,.231,.313,.369,.309
Bo Davis,CF,Padres,,3995,,,,,,,,,,,,,,,,,,,,,,,,,,,,,,,,,,,,,,,,,
Alejandro De Aza,CF,White Sox,,4972,,,,,,,,,,,,,,,,,,,,,153,607,160,27,4,17,,246,84,62,20,8,50,1,6,6,6,.264,.320,.405,.321
Antonio DeJesus,CF,Cardinals,,3524,,,,,,,,,,,,,,,,,,,,,,,,,,,,,,,,,,,,,,,,,
David DeJesus,CF,Rays,,1435,,,,,,,,,,,,,,,,,,,,,122,391,98,29,3,8,,157,52,38,5,3,39,,14,1,2,.251,.338,.402,.328
Javis Diaz,CF,Phillies,,2353,,,,,,,,,,,,,,,,,,,,,,,,,,,,,,,,,,,,,,,,,
Jose Duarte,CF,Marlins,,1416,,,,,,,,,,,,,,,,,,,,,,,,,,,,,,,,,,,,,,,,,
Chris Duffy,CF,Phillies,,2354,,,,,,,,,,,,,,,,,,,,,,,,,,,,,,,,,,,,,,,,,
Todd Dunwoody,CF,Twins,,1556,,,,,,,,,,,,,,,,,,,,,,,,,,,,,,,,,,,,,,,,,
Jarrod Dyson,CF,Royals,,1417,,,,,,,,,,,,,,,,,,,,,87,213,55,9,4,2,,78,30,17,34,6,21,1,1,1,3,.258,.322,.366,.331
Adam Eaton,CF,Diamondbacks,,5316,,,,,,,,,,,,,,,,,,,,,66,250,63,10,4,3,,90,40,22,5,2,17,,6,1,3,.252,.310,.360,.302
Jacoby Ellsbury,CF,Red Sox,,164,,,,,,,,,,,,,,,,,,,,,134,577,172,31,8,9,,246,92,53,52,4,47,3,5,2,1,.298,.354,.426,.361
Alex Escobar,CF,Rockies,,3827,,,,,,,,,,,,,,,,,,,,,,,,,,,,,,,,,,,,,,,,,
Rafael Fernandez,CF,Mets,,6036,,,,,,,,,,,,,,,,,,,,,,,,,,,,,,,,,,,,,,,,,
Daniel Figueroa,CF,Orioles,,469,,,,,,,,,,,,,,,,,,,,,,,,,,,,,,,,,,,,,,,,,
Steve Finley,CF,Rockies,,3828,,,,,,,,,,,,,,,,,,,,,,,,,,,,,,,,,,,,,,,,,
Jeff Fiorentino,CF,Athletics,,470,,,,,,,,,,,,,,,,,,,,,,,,,,,,,,,,,,,,,,,,,
Dexter Fowler,CF,Rockies,,3829,,,,,,,,,,,,,,,,,,,,,119,415,109,18,3,12,,169,71,42,19,9,65,1,6,2,4,.263,.366,.407,.347
Choo Freeman,CF,Dodgers,,4675,,,,,,,,,,,,,,,,,,,,,,,,,,,,,,,,,,,,,,,,,
Chris Frey,CF,Phillies,,3830,,,,,,,,,,,,,,,,,,,,,,,,,,,,,,,,,,,,,,,,,
Rey Fuentes,CF,Padres,,5221,,,,,,,,,,,,,,,,,,,,,23,33,5,,,,,5,4,1,3,,3,,,,,.152,.222,.152,.204
Jesus Galindo,CF,Giants,,5827,,,,,,,,,,,,,,,,,,,,,,,,,,,,,,,,,,,,,,,,,
Avisaíl García,CF,White Sox,,1250,,,,,,,,,,,,,,,,,,,,,72,244,69,7,3,7,,103,31,31,3,3,9,,1,2,,.283,.309,.422,.315
Joey Gathright,CF,Reds,,471,,,,,,,,,,,,,,,,,,,,,,,,,,,,,,,,,,,,,,,,,
Craig Gentry,CF,Rangers,,4517,,,,,,,,,,,,,,,,,,,,,106,246,69,12,4,2,,95,39,22,24,3,29,2,8,1,3,.280,.369,.386,.356
Archie Gilbert,CF,Diamondbacks,,5770,,,,,,,,,,,,,,,,,,,,,,,,,,,,,,,,,,,,,,,,,
Raul Gonzalez,CF,Mets,,2174,,,,,,,,,,,,,,,,,,,,,,,,,,,,,,,,,,,,,,,,,
Reid Gorecki,CF,Yankees,,320,,,,,,,,,,,,,,,,,,,,,,,,,,,,,,,,,,,,,,,,,
Anthony Gose,CF,Blue Jays,,5104,,,,,,,,,,,,,,,,,,,,,52,147,38,6,5,2,,60,15,12,4,3,5,,,,1,.259,.281,.408,.296
Curtis Granderson,CF,Yankees,,321,,,,,,,,,,,,,,,,,,,,,61,214,50,13,2,7,,88,31,15,8,2,27,1,1,1,2,.234,.318,.411,.325
Adam Greenberg,CF,Orioles,,2854,,,,,,,,,,,,,,,,,,,,,,,,,,,,,,,,,,,,,,,,,
Bo Greenwell,CF,Indians,,5295,,,,,,,,,,,,,,,,,,,,,,,,,,,,,,,,,,,,,,,,,
Davy Gregg,CF,Cubs,,2685,,,,,,,,,,,,,,,,,,,,,,,,,,,,,,,,,,,,,,,,,
Robbie Grossman,CF,Astros,,3351,,,,,,,,,,,,,,,,,,,,,63,257,69,14,,4,,95,29,21,6,7,23,,2,1,5,.268,.326,.370,.307
Franklin Gutiérrez,CF,Mariners,,4333,,,,,,,,,,,,,,,,,,,,,41,145,36,7,,10,,73,18,24,3,1,5,,,,1,.248,.272,.503,.331
Freddy Guzman,CF,Rays,,2356,,,,,,,,,,,,,,,,,,,,,1,,,,,,,,1,,1,,,,,,,,,,Inf
Garrett Guzman,CF,Nationals,,2530,,,,,,,,,,,,,,,,,,,,,,,,,,,,,,,,,,,,,,,,,
Carlos Gómez,CF,Brewers,,3164,,,,,,,,,,,,,,,,,,,,,147,536,152,27,10,24,,271,80,73,40,7,37,2,10,6,1,.284,.337,.506,.371
Jerry Hairston,CF,Dodgers,,3978,,,,,,,,,,,,,,,,,,,,,96,204,43,7,,2,,56,17,22,,,14,,2,3,3,.211,.261,.275,.245
Mickey Hall,CF,Indians,,1089,,,,,,,,,,,,,,,,,,,,,,,,,,,,,,,,,,,,,,,,,
Lee Haydel,CF,Brewers,,3165,,,,,,,,,,,,,,,,,,,,,,,,,,,,,,,,,,,,,,,,,
Nathan Haynes,CF,Rangers,,4496,,,,,,,,,,,,,,,,,,,,,,,,,,,,,,,,,,,,,,,,,
Chris Heisey,CF,Reds,,2866,,,,,,,,,,,,,,,,,,,,,87,224,53,11,1,9,,93,29,23,3,,9,,5,2,4,.237,.275,.415,.303
Bear Hill,CF,Marlins,,2003,,,,,,,,,,,,,,,,,,,,,,,,,,,,,,,,,,,,,,,,,
Anthony Jackson,CF,Dodgers,,5342,,,,,,,,,,,,,,,,,,,,,,,,,,,,,,,,,,,,,,,,,
Austin Jackson,CF,Tigers,,1253,,,,,,,,,,,,,,,,,,,,,129,552,150,30,7,12,,230,99,49,8,4,52,,4,3,3,.272,.336,.417,.332
Nic Jackson,CF,Mets,,2175,,,,,,,,,,,,,,,,,,,,,,,,,,,,,,,,,,,,,,,,,
Jon Jay,CF,Cardinals,,3531,,,,,,,,,,,,,,,,,,,,,157,548,151,27,2,7,,203,75,67,10,5,52,7,14,5,9,.276,.346,.370,.320
Desmond Jennings,CF,Rays,,598,,,,,,,,,,,,,,,,,,,,,139,527,133,31,6,14,,218,82,54,20,8,64,,3,5,3,.252,.332,.414,.331
Adam Jones,CF,Orioles,,472,,,,,,,,,,,,,,,,,,,,,160,653,186,35,1,33,,322,100,108,14,3,25,4,8,3,,.285,.318,.493,.349
Alfred Joseph,CF,Cubs,,2687,,,,,,,,,,,,,,,,,,,,,,,,,,,,,,,,,,,,,,,,,
David Kelton,CF,Braves,,1863,,,,,,,,,,,,,,,,,,,,,,,,,,,,,,,,,,,,,,,,,
Matt Kemp,CF,Dodgers,,4676,,,,,,,,,,,,,,,,,,,,,73,263,71,15,,6,,104,35,33,9,,22,3,2,3,,.270,.328,.395,.323
Kevin Kiermaier,CF,Rays,,5374,,,,,,,,,,,,,,,,,,,,,1,,,,,,,,,,,,,,,,,,,,
Rian Kiniry,CF,Angels,,1707,,,,,,,,,,,,,,,,,,,,,,,,,,,,,,,,,,,,,,,,,
Raymond Kruml,CF,Cardinals,,339,,,,,,,,,,,,,,,,,,,,,,,,,,,,,,,,,,,,,,,,,
Peter Lavin,CF,Phillies,,5865,,,,,,,,,,,,,,,,,,,,,,,,,,,,,,,,,,,,,,,,,
Rymer Liriano,CF,Padres,,3999,,,,,,,,,,,,,,,,,,,,,,,,,,,,,,,,,,,,,,,,,
Mark Little,CF,Marlins,,2004,,,,,,,,,,,,,,,,,,,,,,,,,,,,,,,,,,,,,,,,,
Carl Loadenthal,CF,Nationals,,2531,,,,,,,,,,,,,,,,,,,,,,,,,,,,,,,,,,,,,,,,,
Nook Logan,CF,Dodgers,,4677,,,,,,,,,,,,,,,,,,,,,,,,,,,,,,,,,,,,,,,,,
Drew Macias,CF,Angels,,3682,,,,,,,,,,,,,,,,,,,,,,,,,,,,,,,,,,,,,,,,,
Dustin Martin,CF,Mets,,1564,,,,,,,,,,,,,,,,,,,,,,,,,,,,,,,,,,,,,,,,,
Leonys Martin,CF,Rangers,,5493,,,,,,,,,,,,,,,,,,,,,147,457,119,21,6,8,,176,66,49,36,9,28,,8,3,12,.260,.305,.385,.317
Darin Mastroianni,CF,Twins,,771,,,,,,,,,,,,,,,,,,,,,29,65,12,2,,,,14,5,5,2,1,3,,1,1,3,.185,.219,.215,.204
Luis Matos,CF,Twins,,15682,,,,,,,,,,,,,,,,,,,,,,,,,,,,,,,,,,,,,,,,,
Aaron Matthews,CF,Marlins,,790,,,,,,,,,,,,,,,,,,,,,,,,,,,,,,,,,,,,,,,,,
Justin Maxwell,CF,Royals,,2532,,,,,,,,,,,,,,,,,,,,,75,234,59,16,3,7,,102,35,25,6,2,23,,4,1,,.252,.328,.436,.335
John Mayberry,CF,Phillies,,2368,,,,,,,,,,,,,,,,,,,,,134,353,80,23,1,11,,138,47,39,5,3,27,1,3,1,,.227,.286,.391,.295
Cameron Maybin,CF,Padres,,2006,,,,,,,,,,,,,,,,,,,,,14,51,8,1,,1,,12,7,5,4,1,4,1,1,,1,.157,.228,.235,.217
Michael McBryde,CF,Giants,,4148,,,,,,,,,,,,,,,,,,,,,,,,,,,,,,,,,,,,,,,,,
Andrew McCutchen,CF,Pirates,,3354,,,,,,,,,,,,,,,,,,,,,157,583,185,38,5,21,,296,97,84,27,10,78,12,9,4,,.317,.404,.508,.394
Darnell McDonald,CF,Cubs,,160,,,,,,,,,,,,,,,,,,,,,25,53,16,4,,1,,23,4,5,,,4,,,,,.302,.351,.434,.346
Maximo Mendez,CF,Mariners,,4335,,,,,,,,,,,,,,,,,,,,,,,,,,,,,,,,,,,,,,,,,
Eliezer Mesa,CF,Rockies,,5335,,,,,,,,,,,,,,,,,,,,,,,,,,,,,,,,,,,,,,,,,
Erik Miller,CF,Brewers,,3168,,,,,,,,,,,,,,,,,,,,,,,,,,,,,,,,,,,,,,,,,
Javon Moran,CF,Phillies,,2357,,,,,,,,,,,,,,,,,,,,,,,,,,,,,,,,,,,,,,,,,
Willy Mota,CF,White Sox,,930,,,,,,,,,,,,,,,,,,,,,,,,,,,,,,,,,,,,,,,,,
Kirk Nieuwenhuis,CF,Mets,,2179,,,,,,,,,,,,,,,,,,,,,47,95,18,3,1,3,,32,10,14,2,,12,1,,1,,.189,.278,.337,.275
Jeremy Owens,CF,Rays,,600,,,,,,,,,,,,,,,,,,,,,,,,,,,,,,,,,,,,,,,,,
Marcell Ozuna,CF,Marlins,,4946,,,,,,,,,,,,,,,,,,,,,70,275,73,17,4,3,,107,31,32,5,1,13,,2,,1,.265,.302,.389,.307
Angel Pagan,CF,Giants,,2180,,,,,,,,,,,,,,,,,,,,,71,280,79,16,3,5,,116,44,30,9,4,23,,,2,,.282,.334,.414,.330
David Paisano,CF,Rangers,,4497,,,,,,,,,,,,,,,,,,,,,,,,,,,,,,,,,,,,,,,,,
Gerardo Parra,CF,Diamondbacks,,3692,,,,,,,,,,,,,,,,,,,,,156,601,161,43,4,10,,242,79,48,10,10,48,3,3,4,7,.268,.320,.403,.314
Francisco Peguero,CF,Giants,,4149,,,,,,,,,,,,,,,,,,,,,18,29,6,1,,1,,10,4,1,2,,1,,,,,.207,.233,.345,.268
Fernando Perez,CF,Mets,,4911,,,,,,,,,,,,,,,,,,,,,,,,,,,,,,,,,,,,,,,,,
P.J. Phillips,CF,Reds,,1683,,,,,,,,,,,,,,,,,,,,,,,,,,,,,,,,,,,,,,,,,
AJ Pollock,CF,Diamondbacks,,3706,,,,,,,,,,,,,,,,,,,,,137,443,119,28,5,8,,181,64,38,12,3,33,1,2,1,3,.269,.320,.409,.323
Tim Raines,CF,Diamondbacks,,3683,,,,,,,,,,,,,,,,,,,,,,,,,,,,,,,,,,,,,,,,,
Yordany Ramirez,CF,Astros,,3004,,,,,,,,,,,,,,,,,,,,,,,,,,,,,,,,,,,,,,,,,
James Ramsey,CF,Cardinals,,6491,,,,,,,,,,,,,,,,,,,,,,,,,,,,,,,,,,,,,,,,,
James Rapoport,CF,Cardinals,,3525,,,,,,,,,,,,,,,,,,,,,,,,,,,,,,,,,,,,,,,,,
Colby Rasmus,CF,Blue Jays,,3526,,,,,,,,,,,,,,,,,,,,,118,417,115,26,1,22,,209,57,66,,1,37,,3,1,,.276,.338,.501,.360
Melvin Ray,CF,Dodgers,,4679,,,,,,,,,,,,,,,,,,,,,,,,,,,,,,,,,,,,,,,,,
Tike Redman,CF,Orioles,,474,,,,,,,,,,,,,,,,,,,,,,,,,,,,,,,,,,,,,,,,,
Eric Reed,CF,Mets,,2182,,,,,,,,,,,,,,,,,,,,,,,,,,,,,,,,,,,,,,,,,
Ben Revere,CF,Phillies,,1559,,,,,,,,,,,,,,,,,,,,,88,315,96,9,3,,,111,37,17,22,8,16,1,,,5,.305,.333,.352,.314
D`Vontrey Richardson,CF,Brewers,,3169,,,,,,,,,,,,,,,,,,,,,,,,,,,,,,,,,,,,,,,,,
Derrick Robinson,CF,Reds,,1419,,,,,,,,,,,,,,,,,,,,,102,192,49,7,3,,,62,21,8,4,5,18,,1,,5,.255,.315,.323,.286
Shane Robinson,CF,Cardinals,,3527,,,,,,,,,,,,,,,,,,,,,99,144,36,2,1,2,,46,22,16,5,1,23,,,4,,.250,.345,.319,.309
Concepcion Rodriguez,CF,Braves,,1865,,,,,,,,,,,,,,,,,,,,,,,,,,,,,,,,,,,,,,,,,
Mike Rodriguez,CF,Astros,,3005,,,,,,,,,,,,,,,,,,,,,,,,,,,,,,,,,,,,,,,,,
Wilman Rodriguez,CF,Nationals,,5156,,,,,,,,,,,,,,,,,,,,,,,,,,,,,,,,,,,,,,,,,
Wilkin Ruan,CF,Phillies,,2358,,,,,,,,,,,,,,,,,,,,,,,,,,,,,,,,,,,,,,,,,
Justin Ruggiano,CF,Marlins,,4910,,,,,,,,,,,,,,,,,,,,,128,424,94,18,1,18,,168,49,50,15,8,41,1,5,,1,.222,.297,.396,.304
Emeel Salem,CF,Rays,,601,,,,,,,,,,,,,,,,,,,,,,,,,,,,,,,,,,,,,,,,,
Ismael Salgado,CF,Tigers,,5992,,,,,,,,,,,,,,,,,,,,,,,,,,,,,,,,,,,,,,,,,
Dave Sappelt,CF,Cubs,,2856,,,,,,,,,,,,,,,,,,,,,31,75,18,3,,,,21,6,4,3,1,3,,,,,.240,.269,.280,.251
Jordan Schafer,CF,Braves,,1866,,,,,,,,,,,,,,,,,,,,,94,231,57,8,3,3,,80,32,21,22,6,29,2,,,5,.247,.325,.346,.314
Logan Schafer,CF,Brewers,,3170,,,,,,,,,,,,,,,,,,,,,134,298,63,15,3,4,,96,29,33,7,1,25,1,3,,11,.211,.270,.322,.273
Lorenzo Scott,CF,Mets,,4941,,,,,,,,,,,,,,,,,,,,,,,,,,,,,,,,,,,,,,,,,
Tim Sherlock,CF,Diamondbacks,,3684,,,,,,,,,,,,,,,,,,,,,,,,,,,,,,,,,,,,,,,,,
JB Shuck,CF,Angels,,3006,,,,,,,,,,,,,,,,,,,,,129,437,128,20,3,2,,160,60,39,8,4,27,,1,7,6,.293,.326,.366,.310
Joey Side,CF,Diamondbacks,,3685,,,,,,,,,,,,,,,,,,,,,,,,,,,,,,,,,,,,,,,,,
Moises Sierra,CF,Blue Jays,,774,,,,,,,,,,,,,,,,,,,,,35,108,31,13,1,1,,49,11,13,1,,14,1,,1,,.287,.366,.454,.357
Coby Smith,CF,Angels,,1709,,,,,,,,,,,,,,,,,,,,,,,,,,,,,,,,,,,,,,,,,
Carlos Sosa,CF,Giants,,4151,,,,,,,,,,,,,,,,,,,,,,,,,,,,,,,,,,,,,,,,,
Denard Span,CF,Nationals,,1560,,,,,,,,,,,,,,,,,,,,,153,610,169,28,11,4,,231,75,47,20,6,42,,2,1,7,.277,.322,.379,.316
Henri Stanley,CF,Dodgers,,4681,,,,,,,,,,,,,,,,,,,,,,,,,,,,,,,,,,,,,,,,,
Bubba Starling,CF,Royals,,6437,,,,,,,,,,,,,,,,,,,,,,,,,,,,,,,,,,,,,,,,,
T.J. Steele,CF,Padres,,3007,,,,,,,,,,,,,,,,,,,,,,,,,,,,,,,,,,,,,,,,,
Gabriel Suarez,CF,Dodgers,,6132,,,,,,,,,,,,,,,,,,,,,,,,,,,,,,,,,,,,,,,,,
Blake Tekotte,CF,White Sox,,4890,,,,,,,,,,,,,,,,,,,,,20,31,7,1,,1,,11,4,2,1,3,3,,1,1,,.226,.306,.355,.258
James Tomlin,CF,Rangers,,4498,,,,,,,,,,,,,,,,,,,,,,,,,,,,,,,,,,,,,,,,,
Andres Torres,CF,Giants,,4152,,,,,,,,,,,,,,,,,,,,,103,272,68,17,1,2,,93,33,21,4,3,22,1,,4,2,.250,.300,.342,.284
Melvin Upton,CF,Braves,,603,,,,,,,,,,,,,,,,,,,,,126,391,72,14,,9,,113,30,26,12,5,44,2,3,6,1,.184,.267,.289,.252
Juan Valdes,CF,Indians,,1092,,,,,,,,,,,,,,,,,,,,,,,,,,,,,,,,,,,,,,,,,
Jose Valdez,CF,Cubs,,2689,,,,,,,,,,,,,,,,,,,,,,,,,,,,,,,,,,,,,,,,,
Chris Walker,CF,Phillies,,2360,,,,,,,,,,,,,,,,,,,,,,,,,,,,,,,,,,,,,,,,,
Demetrius Washington,CF,Angels,,1711,,,,,,,,,,,,,,,,,,,,,,,,,,,,,,,,,,,,,,,,,
Pat White,CF,Marlins,,4978,,,,,,,,,,,,,,,,,,,,,,,,,,,,,,,,,,,,,,,,,
Keenan Wiley,CF,Braves,,5893,,,,,,,,,,,,,,,,,,,,,,,,,,,,,,,,,,,,,,,,,
Reggie Willits,CF,Angels,,1712,,,,,,,,,,,,,,,,,,,,,,,,,,,,,,,,,,,,,,,,,
David Winfree,CF,Diamondbacks,,323,,,,,,,,,,,,,,,,,,,,,,,,,,,,,,,,,,,,,,,,,
DeWayne Wise,CF,White Sox,,2361,,,,,,,,,,,,,,,,,,,,,30,64,15,3,,1,,21,6,3,1,1,2,,,,,.234,.258,.328,.255
Brent Wyatt,CF,Tigers,,5907,,,,,,,,,,,,,,,,,,,,,,,,,,,,,,,,,,,,,,,,,
Christian Yelich,CF,Marlins,,5764,,,,,,,,,,,,,,,,,,,,,62,240,69,12,1,4,,95,34,16,10,,31,1,1,1,,.287,.370,.396,.351
Eric Young Jr.,CF,Mets,,3833,,,,,,,,,,,,,,,,,,,,,148,539,134,27,7,2,,181,70,32,46,11,46,1,2,1,10,.249,.304,.336,.300
Pedro Zapata,CF,Mets,,2183,,,,,,,,,,,,,,,,,,,,,,,,,,,,,,,,,,,,,,,,,
Matt den Dekker,CF,Mets,,5250,,,,,,,,,,,,,,,,,,,,,27,58,12,1,,1,,16,7,6,4,1,4,,1,,,.207,.270,.276,.258
