Player,Position,ProTeam,RotoTeam,RVid,MLBAMID,BDBID,RotoValue,bG,bAB,bH,b2B,b3B,bHR,bRBOE,bR,bRBI,bSB,bCS,bBB,bIBB,bHBP,bSF,bSH,bAvg,bOBP,bSlg,bwOBA,pG,pIP,pBF,pH,pHR,pK,pPO,pFO,pGO,pLO,pSF,pSH,pBB,pIBB,pHB,pR,pER,pWin,pL,pSav,pStk,pFoul,piBall,pPit,pStk%,pWHIP,pERA,pR/9,pFIP,pkwERA
Miguel Cabrera,1B/3B/DH,Tigers,RotoValue,1210,408234,cabremi01,$34.21,159,611,191,52,1,25,,101,109,1,1,60,10,3,11,,.313,.371,.524,.378,,,,,,,,,,,,,,,,,,,,,,,,,,,,,,
Anthony Rendon,2B/3B,Nationals,,5551,543685,rendoan01,$30.27,153,613,176,39,6,21,,111,83,17,3,58,2,5,5,2,.287,.350,.473,.361,,,,,,,,,,,,,,,,,,,,,,,,,,,,,,
Todd Frazier,1B/3B,Reds,Texas BigSticks,2863,453943,frazito01,$28.31,157,597,163,22,1,29,,88,80,20,8,52,2,7,4,,.273,.336,.459,.346,,,,,,,,,,,,,,,,,,,,,,,,,,,,,,
Josh Donaldson,3B,Athletics,The Seals Guys,4806,518626,donaljo02,$25.61,158,608,155,31,2,29,,93,98,8,,76,5,7,4,,.255,.342,.456,.348,,,,,,,,,,,,,,,,,,,,,,,,,,,,,,
Ian Desmond,SS,Nationals,Old Hoss,2521,435622,desmoia01,$23.06,154,593,151,26,3,24,,73,91,24,5,46,,6,3,,.255,.313,.430,.329,,,,,,,,,,,,,,,,,,,,,,,,,,,,,,
Dee Strange-Gordon,2B/SS,Dodgers,,4670,543829,gordode01,$23.03,148,609,176,24,12,2,,92,34,64,19,31,,4,3,3,.289,.325,.378,.322,,,,,,,,,,,,,,,,,,,,,,,,,,,,,,
Adrián Béltre,3B,Rangers,JetBlack,132,134181,beltrad01,$20.85,148,549,178,33,1,19,,79,77,1,1,57,13,3,5,,.324,.388,.492,.376,,,,,,,,,,,,,,,,,,,,,,,,,,,,,,
Kyle Seager,3B,Mariners,RotoValue,4318,572122,seageky01,$20.27,159,590,158,27,4,25,,71,96,7,5,52,3,8,3,1,.268,.333,.454,.340,,,,,,,,,,,,,,,,,,,,,,,,,,,,,,
Carlos Santana,1B/3B/C/DH,Indians,Dodger Blue,1047,467793,santaca01,$19.38,152,541,125,25,,27,,68,85,5,2,113,5,3,3,,.231,.365,.427,.349,,,,,,,,,,,,,,,,,,,,,,,,,,,,,,
Alexei Ramirez,SS,White Sox,The Seals Guys,922,493351,ramiral03,$18.45,158,622,170,35,2,15,,82,74,21,4,24,,6,4,1,.273,.304,.408,.316,,,,,,,,,,,,,,,,,,,,,,,,,,,,,,
José Reyes,SS,Blue Jays,With the 5th Pick Truck Selects,2168,408314,reyesjo01,$18.28,143,610,175,33,4,9,,94,51,30,2,38,1,1,4,2,.287,.327,.398,.330,,,,,,,,,,,,,,,,,,,,,,,,,,,,,,
Evan Longoria,3B,Rays,With the 5th Pick Truck Selects,583,446334,longoev01,$16.87,162,624,158,26,1,22,,83,91,5,,57,11,9,9,1,.253,.320,.404,.314,,,,,,,,,,,,,,,,,,,,,,,,,,,,,,
Josh Harrison,2B/3B/LF/RF,Pirates,,3327,543281,harrijo05,$16.36,143,520,164,38,7,13,,77,52,18,7,22,1,4,2,2,.315,.345,.490,.363,,,,,,,,,,,,,,,,,,,,,,,,,,,,,,
Jimmy Rollins,SS,Phillies,SportsWiseGuy.com,2345,276519,rolliji01,$12.74,138,538,131,22,4,17,,78,55,28,6,64,2,1,3,3,.243,.322,.394,.323,,,,,,,,,,,,,,,,,,,,,,,,,,,,,,
Troy Tulowitzki,SS,Rockies,Dodger Blue,3825,453064,tulowtr01,$12.38,91,315,107,18,1,21,,71,52,1,1,50,4,5,5,,.340,.432,.603,.436,,,,,,,,,,,,,,,,,,,,,,,,,,,,,,
Hanley Ramírez,SS,Dodgers,Dodger Blue,1999,434670,ramirha01,$10.93,128,449,127,35,,13,,64,71,14,5,56,2,6,1,,.283,.369,.448,.360,,,,,,,,,,,,,,,,,,,,,,,,,,,,,,
Erick Aybar,SS,Angels,JetBlack,1692,430947,aybarer01,$10.56,156,589,164,30,4,7,,77,68,16,9,36,4,5,8,3,.278,.320,.379,.306,,,,,,,,,,,,,,,,,,,,,,,,,,,,,,
Alcides Escobar,SS,Royals,RotoValue,3154,444876,escobal02,$10.46,162,579,165,34,5,3,,74,50,31,6,23,1,6,4,8,.285,.313,.377,.314,,,,,,,,,,,,,,,,,,,,,,,,,,,,,,
Jhonny Peralta,SS,Cardinals,Big Poison,1076,425509,peraljh01,$9.49,157,560,147,38,,21,,61,75,3,2,58,2,6,4,,.263,.336,.443,.338,,,,,,,,,,,,,,,,,,,,,,,,,,,,,,
Pablo Sandoval,3B,Giants,Old Hoss,4138,467055,sandopa01,$9.25,157,588,164,26,3,16,,68,73,,,39,6,4,7,,.279,.324,.415,.320,,,,,,,,,,,,,,,,,,,,,,,,,,,,,,
Matt Carpenter,2B/3B,Cardinals,Moneyball,5070,572761,carpema01,$8.83,158,595,162,33,2,8,,99,59,5,3,95,2,8,9,2,.272,.374,.375,.338,,,,,,,,,,,,,,,,,,,,,,,,,,,,,,
Danny Santana,CF/SS,Twins,,5347,542454,,$8.33,101,405,129,27,7,7,,70,40,20,4,19,,3,1,2,.319,.351,.472,.366,,,,,,,,,,,,,,,,,,,,,,,,,,,,,,
Starlin Castro,SS,Cubs,,2675,516770,castrst01,$7.42,134,528,154,33,1,14,,58,65,4,4,35,4,4,2,,.292,.339,.438,.336,,,,,,,,,,,,,,,,,,,,,,,,,,,,,,
Ben Zobrist,2B/LF/RF/SS,Rays,Big Chee,578,450314,zobribe01,$7.03,146,570,155,34,3,10,,83,52,10,5,75,4,1,6,2,.272,.353,.395,.332,,,,,,,,,,,,,,,,,,,,,,,,,,,,,,
Trevor Plouffe,3B,Twins,,1546,461858,plouftr01,$6.94,136,520,134,40,2,14,,69,80,2,1,53,2,4,5,,.258,.328,.423,.327,,,,,,,,,,,,,,,,,,,,,,,,,,,,,,
Nolan Arenado,3B,Rockies,,5217,571448,arenano01,$6.69,111,432,124,34,2,18,,58,61,2,1,25,1,4,5,1,.287,.328,.500,.353,,,,,,,,,,,,,,,,,,,,,,,,,,,,,,
Asdrúbal Cabrera,2B/SS,Nationals,Moneyball,1079,452678,cabreas01,$4.48,146,553,133,31,4,14,,74,61,10,2,49,2,7,6,1,.241,.307,.387,.307,,,,,,,,,,,,,,,,,,,,,,,,,,,,,,
Aramis Ramirez,3B,Brewers,,2670,133380,ramirar01,$4.46,133,494,141,23,1,15,,47,66,3,,21,2,13,3,,.285,.330,.427,.331,,,,,,,,,,,,,,,,,,,,,,,,,,,,,,
Lonnie Chisenhall,3B,Indians,,1070,502082,chiselo01,$4.12,142,478,134,29,1,13,,62,59,3,1,39,3,8,3,4,.280,.340,.427,.337,,,,,,,,,,,,,,,,,,,,,,,,,,,,,,
Martín Prado,2B/3B/LF,Yankees,Las Vegas Giants,1843,445988,pradoma01,$3.95,143,536,151,26,4,12,,62,58,3,1,26,,7,4,,.282,.321,.412,.322,,,,,,,,,,,,,,,,,,,,,,,,,,,,,,
Chris Davis,1B/3B,Orioles,Las Vegas Giants,4462,448801,davisch02,$3.74,127,450,88,16,,26,,65,72,2,1,60,9,9,5,1,.196,.299,.404,.302,,,,,,,,,,,,,,,,,,,,,,,,,,,,,,
Casey McGehee,3B,Marlins,,3148,431171,mcgehca01,$3.62,160,616,177,29,1,4,,56,76,4,2,67,3,1,7,,.287,.355,.357,.320,,,,,,,,,,,,,,,,,,,,,,,,,,,,,,
Elvis Andrus,SS,Rangers,JetBlack,4483,462101,andruel01,$2.94,157,619,163,35,1,2,,72,41,27,15,46,,3,7,9,.263,.310,.333,.289,,,,,,,,,,,,,,,,,,,,,,,,,,,,,,
David Wright,3B,Mets,SportsWiseGuy.com,2159,431151,wrighda03,$1.00,134,535,144,30,1,8,,54,63,8,5,42,5,4,5,,.269,.324,.374,.306,,,,,,,,,,,,,,,,,,,,,,,,,,,,,,
Luis Valbuena,2B/3B,Cubs,,1067,472528,valbulu01,$1.00,149,478,119,33,4,16,,68,51,1,2,65,4,2,1,1,.249,.340,.435,.337,,,,,,,,,,,,,,,,,,,,,,,,,,,,,,
Pedro Alvarez,3B,Pirates,With the 5th Pick Truck Selects,3320,476883,alvarpe01,$1.00,122,398,92,13,1,18,,46,56,8,3,45,6,2,,,.231,.312,.405,.312,,,,,,,,,,,,,,,,,,,,,,,,,,,,,,
Brandon Crawford,SS,Giants,,4142,543063,crawfbr01,$1.00,153,491,121,20,10,10,,54,69,5,3,59,10,2,10,2,.246,.323,.389,.307,,,,,,,,,,,,,,,,,,,,,,,,,,,,,,
Nick Castellanos,3B,Tigers,,5597,592206,casteni01,$1.00,148,533,138,31,4,11,,50,66,2,2,36,3,3,7,,.259,.306,.394,.303,,,,,,,,,,,,,,,,,,,,,,,,,,,,,,
Justin Turner,3B/SS,Dodgers,,446,457759,turneju01,$1.00,109,288,98,21,1,7,,46,43,6,1,28,1,4,2,,.340,.404,.493,.395,,,,,,,,,,,,,,,,,,,,,,,,,,,,,,
Jordy Mercer,2B/SS,Pirates,,3345,474568,mercejo03,$1.00,149,506,129,27,2,12,,56,55,4,1,35,12,4,5,5,.255,.303,.387,.297,,,,,,,,,,,,,,,,,,,,,,,,,,,,,,
Chris Johnson,3B,Braves,Big Poison,2983,453400,johnsch05,$-1.39,153,582,153,27,,10,,43,58,6,,23,2,2,2,2,.263,.291,.361,.290,,,,,,,,,,,,,,,,,,,,,,,,,,,,,,
Chase Headley,3B,Yankees,Big Chee,3979,452104,headlch01,$-1.56,135,470,114,20,1,13,,55,49,7,3,51,1,9,1,,.243,.328,.372,.313,,,,,,,,,,,,,,,,,,,,,,,,,,,,,,
Juan Uribe,3B,Dodgers,,4132,346874,uribeju01,$-1.64,103,386,120,23,,9,,36,54,,1,15,2,1,2,,.311,.337,.440,.336,,,,,,,,,,,,,,,,,,,,,,,,,,,,,,
J.J. Hardy,SS,Orioles,Big Poison,1552,429666,hardyjj01,$-1.79,141,529,142,28,,9,,56,52,,,29,1,4,4,3,.268,.308,.372,.301,,,,,,,,,,,,,,,,,,,,,,,,,,,,,,
Conor Gillaspie,3B,White Sox,,4135,543216,gillaco01,$-1.84,130,464,131,31,5,7,,50,57,,4,36,4,3,3,,.282,.336,.416,.324,,,,,,,,,,,,,,,,,,,,,,,,,,,,,,
David Freese,3B,Angels,,3514,501896,freesda01,$-2.43,134,462,120,25,1,10,,53,55,1,3,38,,6,5,,.260,.321,.383,.309,,,,,,,,,,,,,,,,,,,,,,,,,,,,,,
Jean Segura,SS,Brewers,Dodger Blue,1744,516416,segurje01,$-3.33,146,513,126,14,6,5,,61,31,20,9,28,5,4,2,10,.246,.284,.326,.272,,,,,,,,,,,,,,,,,,,,,,,,,,,,,,
Brock Holt,2B/3B/RF,Red Sox,,3344,571788,holtbr01,$-3.71,106,449,126,23,5,4,,68,29,12,2,33,,2,3,5,.281,.327,.381,.320,,,,,,,,,,,,,,,,,,,,,,,,,,,,,,
Xander Bogaerts,3B/SS,Red Sox,,6301,593428,bogaexa01,$-4.15,144,538,129,28,1,12,,60,46,2,3,39,1,8,7,2,.240,.296,.362,.289,,,,,,,,,,,,,,,,,,,,,,,,,,,,,,
Derek Jeter,SS,Yankees,,310,116539,jeterde01,$-4.97,145,581,149,19,1,4,,47,50,10,2,35,,6,4,8,.256,.300,.313,.281,,,,,,,,,,,,,,,,,,,,,,,,,,,,,,
Yangervis Solarte,2B/3B/SS,Padres,,1580,500208,,$-5.69,131,469,122,19,1,10,,56,48,,1,53,1,4,6,3,.260,.335,.369,.314,,,,,,,,,,,,,,,,,,,,,,,,,,,,,,
Rougned Odor,2B/SS,Rangers,,5786,596059,,$-6.05,114,386,100,14,7,9,,39,48,4,7,17,1,5,3,6,.259,.293,.402,.297,,,,,,,,,,,,,,,,,,,,,,,,,,,,,,
Jed Lowrie,2B/SS,Athletics,JetBlack,145,476704,lowrije01,$-6.07,136,502,125,29,3,6,,59,50,,,51,5,5,6,2,.249,.320,.355,.299,,,,,,,,,,,,,,,,,,,,,,,,,,,,,,
Matt Dominguez,3B,Astros,Las Vegas Giants,4933,518625,dominma01,$-6.20,157,564,121,17,,16,,51,57,,1,29,2,5,7,2,.215,.255,.330,.256,,,,,,,,,,,,,,,,,,,,,,,,,,,,,,
Mark Reynolds,1B/3B,Brewers,Big Poison,3664,448602,reynoma01,$-6.21,130,378,74,9,,22,,47,45,5,1,47,3,3,4,1,.196,.286,.394,.297,,,,,,,,,,,,,,,,,,,,,,,,,,,,,,
Eduardo Escobar,3B/SS,Twins,,917,500871,escobed01,$-6.73,133,433,119,35,2,6,,52,37,1,1,24,1,2,2,4,.275,.312,.406,.314,,,,,,,,,,,,,,,,,,,,,,,,,,,,,,
Adeiny Hechavarría,SS,Marlins,,4952,588751,hechaad01,$-6.86,146,536,148,20,10,1,,53,34,7,5,26,5,1,6,4,.276,.305,.356,.289,,,,,,,,,,,,,,,,,,,,,,,,,,,,,,
Manny Machado,3B,Orioles,SportsWiseGuy.com,5319,592518,machama01,$-6.97,82,327,91,14,,12,,38,32,2,,20,2,3,2,2,.278,.322,.431,.329,,,,,,,,,,,,,,,,,,,,,,,,,,,,,,
Emilio Bonifácio,2B/CF/LF/SS,Braves,Texas BigSticks,1986,466988,bonifem01,$-7.17,110,394,102,17,4,3,,47,24,26,8,26,2,,,6,.259,.300,.345,.295,,,,,,,,,,,,,,,,,,,,,,,,,,,,,,
Mike Moustakas,3B,Royals,,1398,519058,moustmi01,$-7.31,140,457,97,21,1,15,,45,54,1,,35,1,3,4,1,.212,.270,.361,.277,,,,,,,,,,,,,,,,,,,,,,,,,,,,,,
Cody Asche,3B,Phillies,,6253,605125,ascheco01,$-7.50,121,397,100,25,,10,,43,46,,1,33,4,,1,3,.252,.306,.390,.303,,,,,,,,,,,,,,,,,,,,,,,,,,,,,,
Andrelton Simmons,SS,Braves,JetBlack,5583,592743,simmoan01,$-8.58,146,540,132,18,4,7,,44,46,4,5,32,4,,2,2,.244,.285,.331,.270,,,,,,,,,,,,,,,,,,,,,,,,,,,,,,
Juan Francisco,1B/3B,Blue Jays,,2835,464433,francju02,$-9.88,106,287,63,16,2,16,,40,43,,2,27,,3,3,,.220,.291,.456,.317,,,,,,,,,,,,,,,,,,,,,,,,,,,,,,
Brad Miller,SS,Mariners,,5680,543543,millebr02,$-10.12,123,367,81,15,4,10,,47,36,4,2,34,2,2,3,3,.221,.286,.365,.287,,,,,,,,,,,,,,,,,,,,,,,,,,,,,,
Mike Aviles,2B/3B/LF/SS,Indians,RotoValue,1400,449107,avilemi01,$-10.31,113,344,85,16,1,5,,38,39,14,5,13,,1,5,11,.247,.265,.343,.273,,,,,,,,,,,,,,,,,,,,,,,,,,,,,,
Josh Rutledge,2B/SS,Rockies,,5774,592710,rutlejo01,$-10.87,105,309,83,16,7,4,,44,33,2,3,20,,6,2,5,.269,.319,.405,.317,,,,,,,,,,,,,,,,,,,,,,,,,,,,,,
Yunel Escobar,SS,Rays,Las Vegas Giants,1854,488862,escobyu01,$-11.22,137,476,123,18,,7,,33,39,1,1,43,3,4,2,4,.258,.321,.340,.297,,,,,,,,,,,,,,,,,,,,,,,,,,,,,,
Chris Owings,SS,Diamondbacks,,3674,572008,owingch01,$-11.57,91,310,81,15,6,6,,34,26,8,1,16,,2,2,2,.261,.298,.406,.312,,,,,,,,,,,,,,,,,,,,,,,,,,,,,,
Alexi Amarista,2B/3B/CF/SS,Padres,,1677,506560,amarial01,$-11.76,148,423,101,13,2,5,,39,40,12,1,29,5,1,5,8,.239,.281,.314,.270,,,,,,,,,,,,,,,,,,,,,,,,,,,,,,
Jonathan Villar,SS,Astros,,5185,542340,villajo01,$-12.01,87,263,55,13,2,7,,31,27,17,4,19,1,2,1,4,.209,.263,.354,.280,,,,,,,,,,,,,,,,,,,,,,,,,,,,,,
Zack Cozart,SS,Reds,Texas BigSticks,2842,446359,cozarza01,$-13.10,147,506,112,18,5,4,,48,38,7,,25,3,7,,5,.221,.265,.300,.256,,,,,,,,,,,,,,,,,,,,,,,,,,,,,,
Brett Lawrie,2B/3B,Blue Jays,,3141,543434,lawribr01,$-13.15,70,259,64,9,,12,,27,38,,,16,,5,2,,.247,.301,.421,.314,,,,,,,,,,,,,,,,,,,,,,,,,,,,,,
Everth Cabrera,SS,Padres,Old Hoss,3984,465784,cabreev01,$-13.23,90,357,83,13,1,3,,36,20,18,8,20,,1,4,9,.232,.266,.300,.258,,,,,,,,,,,,,,,,,,,,,,,,,,,,,,
Marwin Gonzalez,SS,Astros,,2731,503556,gonzama01,$-13.31,103,285,79,15,1,6,,33,23,2,4,17,,4,,4,.277,.323,.400,.317,,,,,,,,,,,,,,,,,,,,,,,,,,,,,,
Eduardo Núñez,3B/SS,Twins,,314,456488,nunezed02,$-15.38,72,204,51,7,4,4,,26,24,9,3,5,,1,,3,.250,.268,.382,.288,,,,,,,,,,,,,,,,,,,,,,,,,,,,,,
Didi Gregorius,SS,Diamondbacks,,5332,544369,gregodi01,$-15.64,80,270,61,9,5,6,,35,27,3,,22,3,3,2,2,.226,.288,.363,.287,,,,,,,,,,,,,,,,,,,,,,,,,,,,,,
Ryan Zimmerman,3B/LF,Nationals,Old Hoss,2519,475582,zimmery01,$-15.67,61,214,60,19,1,5,,26,38,,,22,,,4,,.280,.342,.449,.343,,,,,,,,,,,,,,,,,,,,,,,,,,,,,,
Wilmer Flores,3B/SS,Mets,,2165,527038,florewi01,$-15.72,78,259,65,13,1,6,,28,29,1,,12,2,1,1,1,.251,.285,.378,.289,,,,,,,,,,,,,,,,,,,,,,,,,,,,,,
Arismendy Alcántara,2B/CF/SS,Cubs,,6865,570489,,$-16.02,70,278,57,11,2,10,,31,29,8,5,17,,2,2,1,.205,.253,.367,.269,,,,,,,,,,,,,,,,,,,,,,,,,,,,,,
Rubén Tejada,SS,Mets,,2170,514913,tejadru01,$-16.18,119,355,84,11,,5,,30,34,1,2,50,11,8,2,4,.237,.339,.310,.290,,,,,,,,,,,,,,,,,,,,,,,,,,,,,,
Joe Panik,2B/SS,Giants,,5635,605412,,$-16.33,73,269,82,10,2,1,,31,18,,,16,,,1,1,.305,.341,.368,.318,,,,,,,,,,,,,,,,,,,,,,,,,,,,,,
José Ramírez,2B/SS,Indians,,6941,608070,ramirjo01,$-16.42,68,237,62,10,2,2,,27,17,10,1,13,,1,2,13,.262,.286,.346,.295,,,,,,,,,,,,,,,,,,,,,,,,,,,,,,
Eugenio Suárez,SS,Tigers,,5905,553993,,$-16.71,85,244,59,9,1,4,,33,23,3,2,22,1,5,1,5,.242,.310,.336,.293,,,,,,,,,,,,,,,,,,,,,,,,,,,,,,
Marcus Semien,2B/3B/SS,White Sox,,5897,543760,semiema01,$-18.04,64,231,54,10,2,6,,30,28,3,,21,,1,,2,.234,.298,.372,.301,,,,,,,,,,,,,,,,,,,,,,,,,,,,,,
Ryan Flaherty,2B/3B/SS,Orioles,,2676,475247,flahery01,$-18.09,102,281,62,15,1,7,,33,32,1,,22,2,5,1,3,.221,.285,.356,.284,,,,,,,,,,,,,,,,,,,,,,,,,,,,,,
Mike Olt,3B,Cubs,,5244,592609,oltmi01,$-18.42,89,225,36,8,,12,,23,33,,1,25,,3,5,,.160,.248,.356,.262,,,,,,,,,,,,,,,,,,,,,,,,,,,,,,
Andrew Romine,3B/SS,Tigers,,1699,461865,rominan01,$-18.67,94,251,57,6,,2,,30,12,12,2,18,,,,4,.227,.275,.275,.261,,,,,,,,,,,,,,,,,,,,,,,,,,,,,,
Derek Dietrich,2B/SS,Marlins,,6087,518618,dietrde01,$-18.73,49,158,36,6,2,5,,31,17,1,,13,,10,,2,.228,.322,.386,.319,,,,,,,,,,,,,,,,,,,,,,,,,,,,,,
Alberto Callaspo,1B/2B/3B/DH,Athletics,,1392,430948,callaal01,$-18.91,127,404,90,15,,4,,37,39,,1,40,1,1,6,,.223,.290,.290,.263,,,,,,,,,,,,,,,,,,,,,,,,,,,,,,
Jeff Baker,1B/2B/3B/LF,Marlins,,2655,425557,bakerje03,$-19.19,90,208,55,10,4,3,,27,28,1,,13,1,1,3,,.264,.307,.394,.306,,,,,,,,,,,,,,,,,,,,,,,,,,,,,,
Javier Báez,2B/SS,Cubs,,6040,595879,,$-19.45,52,213,36,6,,9,,25,20,5,1,15,,1,,,.169,.227,.324,.246,,,,,,,,,,,,,,,,,,,,,,,,,,,,,,
Kristopher Negrón,3B/CF,Reds,,2846,502117,negrokr01,$-19.72,49,144,39,10,1,6,,19,17,5,,12,,1,,1,.271,.329,.479,.358,,,,,,,,,,,,,,,,,,,,,,,,,,,,,,
Logan Forsythe,2B/3B/DH,Rays,,3977,523253,forsylo01,$-19.72,110,301,67,12,1,6,,32,26,2,,25,,4,4,2,.223,.286,.329,.277,,,,,,,,,,,,,,,,,,,,,,,,,,,,,,
Kelly Johnson,1B/2B/3B/LF,Orioles,,3653,430637,johnske05,$-19.77,106,265,57,14,2,7,,29,27,2,2,29,,2,1,,.215,.296,.362,.291,,,,,,,,,,,,,,,,,,,,,,,,,,,,,,
Danny Valencia,1B/3B/DH,Blue Jays,,1549,502143,valenda01,$-19.96,86,264,68,16,1,4,,20,30,1,1,14,,2,4,,.258,.296,.371,.292,,,,,,,,,,,,,,,,,,,,,,,,,,,,,,
Munenori Kawasaki,2B/SS,Blue Jays,,5565,493128,kawasmu01,$-20.20,82,240,62,7,1,,,31,17,1,,22,,3,1,8,.258,.318,.296,.288,,,,,,,,,,,,,,,,,,,,,,,,,,,,,,
Cliff Pennington,2B/SS,Diamondbacks,,4846,460060,pennicl01,$-20.89,68,177,45,5,3,2,,21,10,6,1,20,,3,,1,.254,.338,.350,.318,,,,,,,,,,,,,,,,,,,,,,,,,,,,,,
Adam Rosales,1B/2B/SS,Rangers,,4847,489267,rosalad01,$-20.93,56,164,43,7,,4,,20,19,4,2,13,,3,,,.262,.328,.378,.315,,,,,,,,,,,,,,,,,,,,,,,,,,,,,,
Steve Tolleson,2B/3B,Blue Jays,,4833,476270,tollest01,$-22.30,108,170,43,7,2,3,,21,16,3,1,12,,2,1,4,.253,.302,.371,.302,,,,,,,,,,,,,,,,,,,,,,,,,,,,,,
Chris Taylor,SS,Mariners,,6789,621035,,$-22.37,47,136,39,8,,,,16,9,5,2,11,,2,1,1,.287,.344,.346,.315,,,,,,,,,,,,,,,,,,,,,,,,,,,,,,
Willie Bloomquist,2B/SS,Mariners,,1382,217100,bloomwi01,$-22.78,47,133,37,6,,1,,15,14,1,1,4,1,,1,1,.278,.295,.346,.280,,,,,,,,,,,,,,,,,,,,,,,,,,,,,,
Ryan Rua,3B,Rangers,,10470,607387,,$-22.91,28,105,31,7,,2,,11,14,1,,2,,2,,,.295,.321,.419,.327,,,,,,,,,,,,,,,,,,,,,,,,,,,,,,
Zach Walters,DH/SS,Indians,,5314,595025,walteza01,$-23.01,62,127,23,3,,10,,16,17,,,9,,1,,,.181,.241,.441,.290,,,,,,,,,,,,,,,,,,,,,,,,,,,,,,
Eric Campbell,3B/LF,Mets,,2153,493472,,$-23.14,85,190,50,9,,3,,16,16,3,,17,,1,3,,.263,.322,.358,.307,,,,,,,,,,,,,,,,,,,,,,,,,,,,,,
Brandon Hicks,2B/3B,Giants,,1857,518794,hicksbr01,$-23.25,71,204,33,6,1,8,,27,22,,1,32,3,2,1,3,.162,.277,.319,.265,,,,,,,,,,,,,,,,,,,,,,,,,,,,,,
Jake Lamb,3B,Diamondbacks,,6457,571875,,$-23.58,37,126,29,4,1,4,,15,11,1,1,6,,,1,,.230,.263,.373,.275,,,,,,,,,,,,,,,,,,,,,,,,,,,,,,
Ramon Santiago,2B/3B/SS,Reds,,1246,421124,santira01,$-23.96,75,179,44,8,,2,,20,17,2,1,24,,3,1,7,.246,.332,.324,.307,,,,,,,,,,,,,,,,,,,,,,,,,,,,,,
Jake Smolinski,3B/OF,Rangers,,5477,519295,,$-24.02,24,86,30,5,,3,,12,12,,,3,,3,,,.349,.391,.512,.394,,,,,,,,,,,,,,,,,,,,,,,,,,,,,,
Stephen Drew,2B/SS,Yankees,Big Chee,3668,452220,drewst01,$-24.09,85,271,44,14,1,7,,18,26,1,1,27,3,,2,,.162,.237,.299,.234,,,,,,,,,,,,,,,,,,,,,,,,,,,,,,
Luis Sardiñas,SS,Rangers,,6417,596143,,$-24.36,43,115,30,6,,,,12,8,5,1,5,,2,,3,.261,.296,.313,.285,,,,,,,,,,,,,,,,,,,,,,,,,,,,,,
Chris Valaika,SS,Cubs,,2850,453362,valaich01,$-24.45,44,121,28,4,,3,,10,13,1,,7,1,2,1,,.231,.282,.339,.275,,,,,,,,,,,,,,,,,,,,,,,,,,,,,,
Don Kelly,1B/3B/CF/LF/RF,Tigers,,1254,430603,kellydo01,$-24.82,95,163,40,5,1,,,24,7,6,1,20,1,1,,1,.245,.330,.288,.292,,,,,,,,,,,,,,,,,,,,,,,,,,,,,,
Kevin Frandsen,1B/2B/3B/LF,Nationals,,119,435623,frandke01,$-25.14,105,220,57,8,,1,,17,17,,,6,,7,1,2,.259,.297,.309,.275,,,,,,,,,,,,,,,,,,,,,,,,,,,,,,
Eric Chavez,3B,Diamondbacks,,4871,136767,chaveer01,$-25.48,44,69,17,3,1,3,,6,8,2,,11,,,1,,.246,.346,.449,.352,,,,,,,,,,,,,,,,,,,,,,,,,,,,,,
Charlie Culberson,2B/3B/LF/SS,Rockies,,5064,518586,culbech01,$-25.59,95,210,41,7,2,3,,17,24,2,2,12,2,5,2,4,.195,.249,.290,.238,,,,,,,,,,,,,,,,,,,,,,,,,,,,,,
Christian Colón,SS,Royals,,5201,518568,,$-25.84,21,45,15,5,1,,,8,6,2,,3,,,,1,.333,.367,.489,.386,,,,,,,,,,,,,,,,,,,,,,,,,,,,,,
Clint Barmes,SS,Pirates,,3799,425549,barmecl01,$-25.85,48,102,25,5,,,,15,7,1,1,9,2,4,1,,.245,.328,.294,.278,,,,,,,,,,,,,,,,,,,,,,,,,,,,,,
Joaquin Arias,2B/3B/SS,Giants,,4471,435078,ariasjo01,$-25.86,107,193,49,9,,,,18,15,1,,8,2,,2,1,.254,.279,.301,.257,,,,,,,,,,,,,,,,,,,,,,,,,,,,,,
Ryan Wheeler,3B,Angels,,3651,572253,wheelry01,$-25.97,31,56,13,2,,2,,6,13,,,5,,,3,,.232,.281,.375,.283,,,,,,,,,,,,,,,,,,,,,,,,,,,,,,
Nick Punto,2B/3B/SS,Athletics,,1547,346857,puntoni01,$-26.14,73,198,41,7,2,2,,21,14,3,1,25,,,,1,.207,.295,.293,.272,,,,,,,,,,,,,,,,,,,,,,,,,,,,,,
Will Middlebrooks,3B,Red Sox,,5215,519025,middlwi01,$-26.27,63,215,41,10,,2,,14,19,1,1,15,1,4,,,.191,.256,.265,.236,,,,,,,,,,,,,,,,,,,,,,,,,,,,,,
Ed Lucas,1B/2B/3B,Rangers,,1397,448296,lucased01,$-26.39,69,179,45,5,,1,,19,9,1,,8,,,,2,.251,.280,.296,.263,,,,,,,,,,,,,,,,,,,,,,,,,,,,,,
Kevin Kouzmanoff,1B/3B,Rangers,,4837,450260,kouzmke01,$-26.62,13,47,17,6,,2,,8,10,,,2,1,2,,,.362,.412,.617,.434,,,,,,,,,,,,,,,,,,,,,,,,,,,,,,
Jonathan Herrera,2B/SS,Red Sox,,3803,468406,herrejo03,$-26.71,42,90,21,1,2,,,10,9,1,3,7,,3,1,3,.233,.298,.289,.261,,,,,,,,,,,,,,,,,,,,,,,,,,,,,,
Donnie Murphy,2B/3B,Braves,,1998,430906,murphdo01,$-26.89,45,112,22,3,,4,,11,14,,1,11,,1,3,1,.196,.266,.330,.261,,,,,,,,,,,,,,,,,,,,,,,,,,,,,,
Daniel Descalso,2B/3B/SS,Cardinals,,3506,518614,descada01,$-26.95,104,161,39,11,,,,20,10,1,3,20,,2,,1,.242,.332,.311,.290,,,,,,,,,,,,,,,,,,,,,,,,,,,,,,
Ramiro Pena,2B/3B,Braves,,315,455369,penara02,$-27.10,81,147,36,6,,3,,9,9,1,,13,3,,1,4,.245,.297,.347,.285,,,,,,,,,,,,,,,,,,,,,,,,,,,,,,
Grant Green,2B/3B,Angels,,4844,502205,greengr01,$-27.36,43,99,27,5,,1,,7,11,1,4,2,,,2,,.273,.282,.354,.260,,,,,,,,,,,,,,,,,,,,,,,,,,,,,,
Ehire Adrianza,2B/SS,Giants,,4140,501303,adriaeh01,$-27.44,53,97,23,6,,,,10,5,1,1,5,1,1,1,2,.237,.274,.299,.253,,,,,,,,,,,,,,,,,,,,,,,,,,,,,,
Freddy Galvis,2B/3B/SS,Phillies,,2342,520471,galvifr01,$-27.46,43,119,21,3,1,4,,14,12,1,,8,,,1,,.176,.227,.319,.241,,,,,,,,,,,,,,,,,,,,,,,,,,,,,,
Josh Wilson,3B,Rangers,,4329,425543,wilsojo03,$-27.49,24,67,16,4,,,,7,8,1,,2,,1,,2,.239,.264,.299,.259,,,,,,,,,,,,,,,,,,,,,,,,,,,,,,
Ian Stewart,3B,Angels,,3819,456655,stewaia01,$-27.51,24,68,12,2,3,2,,8,7,1,,3,,1,,,.176,.222,.382,.262,,,,,,,,,,,,,,,,,,,,,,,,,,,,,,
Matt Duffy,SS,Giants,,10023,622110,,$-27.53,34,60,16,2,,,,5,8,,1,1,,2,,1,.267,.297,.300,.265,,,,,,,,,,,,,,,,,,,,,,,,,,,,,,
Reid Brignac,3B/SS,Phillies,,588,458582,brignre01,$-27.55,37,81,18,5,1,1,,4,10,1,1,9,1,,,1,.222,.297,.346,.282,,,,,,,,,,,,,,,,,,,,,,,,,,,,,,
Pedro Ciriaco,2B/SS,Braves,,3667,465674,ciriape01,$-27.63,25,47,10,2,,,,7,2,4,,,,1,,1,.213,.224,.255,.237,,,,,,,,,,,,,,,,,,,,,,,,,,,,,,
Miguel Rojas,SS,Dodgers,,2847,500743,,$-27.78,85,149,27,3,,1,,16,9,,,10,1,2,,1,.181,.241,.221,.213,,,,,,,,,,,,,,,,,,,,,,,,,,,,,,
Yolmer Sánchez,2B/SS,White Sox,,5800,570560,,$-27.90,28,100,25,5,,,,6,5,1,1,3,,,1,,.250,.269,.300,.251,,,,,,,,,,,,,,,,,,,,,,,,,,,,,,
Chone Figgins,3B,Dodgers,,4307,408210,figgich01,$-27.94,38,60,13,3,,,,8,1,4,1,14,,1,,1,.217,.368,.267,.317,,,,,,,,,,,,,,,,,,,,,,,,,,,,,,
Garin Cecchini,3B,Red Sox,,6920,594555,,$-27.95,11,31,8,3,,1,,6,4,,,3,,2,,,.258,.361,.452,.357,,,,,,,,,,,,,,,,,,,,,,,,,,,,,,
Zelous Wheeler,3B,Yankees,,3149,519412,,$-28.17,29,57,11,,,2,,6,5,,,2,,1,1,1,.193,.226,.298,.233,,,,,,,,,,,,,,,,,,,,,,,,,,,,,,
Nick Ahmed,SS,Diamondbacks,,5892,605113,,$-28.20,25,70,14,2,,1,,9,4,,1,3,,,,2,.200,.227,.271,.219,,,,,,,,,,,,,,,,,,,,,,,,,,,,,,
Chris Nelson,3B,Padres,,3823,455126,nelsoch01,$-28.24,27,73,17,3,,,,5,7,1,2,7,1,,1,,.233,.296,.274,.247,,,,,,,,,,,,,,,,,,,,,,,,,,,,,,
Cole Figueroa,3B,Rays,,4886,502676,,$-28.41,23,43,10,2,1,,,6,6,,,4,,,2,,.233,.286,.326,.269,,,,,,,,,,,,,,,,,,,,,,,,,,,,,,
Carlos Rivero,3B,Red Sox,,1083,491640,,$-28.56,4,7,4,2,,1,,1,3,,,1,,,,,.571,.625,1.286,.763,,,,,,,,,,,,,,,,,,,,,,,,,,,,,,
Shawn O'Malley,SS,Angels,,591,502523,,$-29.09,11,16,3,,,,,3,1,2,,,,,,,.188,.188,.188,.200,,,,,,,,,,,,,,,,,,,,,,,,,,,,,,
Pete Kozma,SS,Cardinals,,3520,518902,kozmape01,$-29.19,14,23,7,3,,,,4,,,,3,,,,,.304,.385,.435,.363,,,,,,,,,,,,,,,,,,,,,,,,,,,,,,
Dean Anna,SS,Pirates,,3983,542883,,$-29.26,12,22,3,1,,1,,3,3,,,2,,,1,,.136,.200,.318,.222,,,,,,,,,,,,,,,,,,,,,,,,,,,,,,
Erisbel Arruebarrena,SS,Dodgers,,7463,628326,,$-29.39,22,41,8,1,,,,4,4,,,3,,,1,,.195,.244,.220,.214,,,,,,,,,,,,,,,,,,,,,,,,,,,,,,
Carlos Triunfel,SS,Dodgers,,4328,508892,triunca01,$-29.44,12,15,2,,,1,,3,1,,,1,,,,,.133,.188,.333,.225,,,,,,,,,,,,,,,,,,,,,,,,,,,,,,
Andy Marte,3B,Diamondbacks,,1058,429708,martean01,$-29.46,6,16,3,,,1,,1,3,,,,,,,,.188,.188,.375,.237,,,,,,,,,,,,,,,,,,,,,,,,,,,,,,
Jonathan Diaz,SS,Blue Jays,,741,502409,diazjo02,$-29.57,23,38,6,1,,,,3,4,1,,3,,2,,2,.158,.244,.184,.221,,,,,,,,,,,,,,,,,,,,,,,,,,,,,,
Adam Duvall,1B/3B,Giants,,6383,594807,,$-29.67,28,73,14,2,,3,,8,5,,,3,,1,,,.192,.234,.342,.252,,,,,,,,,,,,,,,,,,,,,,,,,,,,,,
Omar Quintanilla,2B/SS,Mets,,3807,435560,quintom01,$-29.69,15,29,6,1,,,,2,3,,,2,,,,,.207,.258,.241,.231,,,,,,,,,,,,,,,,,,,,,,,,,,,,,,
Tyler Pastornicky,2B/SS,Braves,,746,543629,pastoty01,$-29.71,28,40,8,,1,,,4,2,,1,6,,,,1,.200,.298,.250,.252,,,,,,,,,,,,,,,,,,,,,,,,,,,,,,
Maikel Franco,3B,Phillies,,7402,596748,,$-29.72,16,56,10,2,,,,5,5,,,1,,,1,,.179,.190,.214,.179,,,,,,,,,,,,,,,,,,,,,,,,,,,,,,
Doug Bernier,SS,Twins,,3335,448674,bernido01,$-29.84,7,7,2,,,,,2,,,,1,,1,,,.286,.444,.286,.356,,,,,,,,,,,,,,,,,,,,,,,,,,,,,,
Chase d'Arnaud,SS,Pirates,,3338,488818,darnach01,$-29.90,8,,,,,,,2,,,2,,,,,,,,,-Inf,,,,,,,,,,,,,,,,,,,,,,,,,,,,,,
Jason Bartlett,SS,Twins,,586,430583,bartlja01,$-29.91,3,3,,,,,,3,,,,,,1,,,,.250,,.175,,,,,,,,,,,,,,,,,,,,,,,,,,,,,,
Pedro Florimon,SS,Nationals,,463,465753,floripe01,$-29.96,33,76,7,1,1,,,7,1,6,,8,,,,2,.092,.174,.132,.172,,,,,,,,,,,,,,,,,,,,,,,,,,,,,,
John McDonald,3B/SS,Angels,,766,150348,mcdonjo03,$-30.14,95,76,13,2,,,,4,5,1,1,7,,2,1,5,.171,.242,.197,.215,,,,,,,,,,,,,,,,,,,,,,,,,,,,,,
Jeff Bianchi,3B/SS,Brewers,,1402,488703,biancje01,$-30.15,29,70,12,1,,,,4,6,,,3,,,1,,.171,.203,.186,.179,,,,,,,,,,,,,,,,,,,,,,,,,,,,,,
Chris Dominguez,3B,Giants,,5354,458689,,$-30.28,8,17,1,,,1,,1,2,,,1,1,,,,.059,.111,.235,.118,,,,,,,,,,,,,,,,,,,,,,,,,,,,,,
Hector Gomez,SS,Brewers,,3821,467143,gomezhe01,$-30.28,15,20,3,1,,,,2,1,,,1,,,,,.150,.190,.200,.179,,,,,,,,,,,,,,,,,,,,,,,,,,,,,,