Player,Position,ProTeam,RotoTeam,RVid,MLBAMID,BDBID,RotoValue,pG,pIP,pH,pHR,pK,pBB,pIBB,pHB,pER,pWin,pL,pSav,pWHIP,pERA,pFIP,bG,bAB,bH,b2B,b3B,bHR,bRBOE,bR,bRBI,bSB,bCS,bBB,bIBB,bHBP,bSF,bSH,bAvg,bOBP,bSlg,bwOBA
Justin Upton,LF,Angels,Roto Value,3709,457708,uptonju01,$27.47,,,,,,,,,,,,,,,,152,557,152,44,,35,5,100,109,14,5,74,3,3,1,,.273,.361,.540,.392
Mike Trout,CF,Angels,Las Vegas Giants,1710,545361,troutmi01,$24.61,,,,,,,,,,,,,,,,114,402,123,25,3,33,5,92,72,22,4,94,15,7,4,,.306,.442,.629,.459
Andrelton Simmons,SS,Angels,,5583,592743,simmoan01,$8.84,,,,,,,,,,,,,,,,158,589,164,38,2,14,6,77,69,19,6,47,,3,8,,.278,.331,.421,.340
Zack Cozart,SS,Angels,,2842,446359,cozarza01,$7.23,,,,,,,,,,,,,,,,122,438,130,24,7,24,5,80,63,3,,62,,3,4,,.297,.385,.548,.409
Brandon Phillips,2B/3B,Angels,The Seals Guys,2833,408252,phillbr01,$4.87,,,,,,,,,,,,,,,,144,572,163,34,1,13,3,81,60,11,8,21,1,8,1,2,.285,.318,.416,.324
Ian Kinsler,2B,Angels,Old Hoss,4474,435079,kinslia01,$1.70,,,,,,,,,,,,,,,,139,551,130,25,3,22,1,90,52,14,5,55,2,7,,,.236,.313,.412,.321
Albert Pujols,1B/DH,Angels,Dodger Blue,3503,405395,pujolal01,$1.00,,,,,,,,,,,,,,,,149,593,143,17,,23,,53,101,3,,37,5,2,4,,.241,.286,.386,.292
Kole Calhoun,RF,Angels,SportsWiseGuy.com,5340,594777,calhoko01,$1.00,,,,,,,,,,,,,,,,155,569,139,23,2,19,4,77,71,5,1,71,4,8,6,,.244,.333,.392,.327
Martín Maldonado,C,Angels,,3122,455117,maldoma01,$-4.30,,,,,,,,,,,,,,,,138,429,95,19,1,14,2,43,38,,2,15,1,18,1,8,.221,.272,.368,.285
C.J. Cron,1B,Angels,Moneyball,6756,543068,,$-11.77,,,,,,,,,,,,,,,,100,339,84,14,1,16,2,39,56,3,2,22,,7,3,,.248,.305,.437,.325
Luis Valbuena,1B/3B,Angels,,1067,472528,valbulu01,$-14.43,,,,,,,,,,,,,,,,117,347,69,15,,22,,42,65,,2,48,1,1,5,,.199,.294,.432,.310
Yunel Escobar,3B,Angels,,1854,488862,escobyu01,$-16.90,,,,,,,,,,,,,,,,89,350,96,20,1,7,3,43,31,1,4,29,,2,,,.274,.333,.397,.327
Ben Revere,CF/LF/RF,Angels,,1559,519184,reverbe01,$-16.98,,,,,,,,,,,,,,,,109,291,80,13,2,1,6,37,20,21,6,15,,,2,,.275,.308,.344,.316
Juan Graterol,C,Angels,,6995,492802,,$-20.11,,,,,,,,,,,,,,,,48,84,17,4,,,1,5,10,,,1,,,2,,.202,.207,.250,.210
Eric Young Jr.,CF/LF,Angels,,3833,458913,younger03,$-20.58,,,,,,,,,,,,,,,,47,110,29,5,,4,2,24,16,12,3,5,,7,,3,.264,.328,.418,.360
Carlos Pérez,C,Angels,,2639,542208,,$-21.35,,,,,,,,,,,,,,,,11,20,2,,,1,,1,3,,,1,,,,,.100,.143,.250,.171
Francisco Arcia,C,Angels,,6290,516472,,$-21.60,,,,,,,,,,,,,,,,,,,,,,,,,,,,,,,,,,,
José Briceño,C,Angels,,6089,593993,,$-21.60,,,,,,,,,,,,,,,,,,,,,,,,,,,,,,,,,,,
Jack Kruger,C,Angels,,11698,667674,,$-21.60,,,,,,,,,,,,,,,,,,,,,,,,,,,,,,,,,,,
Taylor Ward,C,Angels,,11351,621493,,$-21.60,,,,,,,,,,,,,,,,,,,,,,,,,,,,,,,,,,,
Hutton Moyer,2B,Angels,,11656,656773,,$-21.95,,,,,,,,,,,,,,,,,,,,,,,,,,,,,,,,,,,
Nolan Fontana,2B,Angels,,6455,545337,,$-21.98,,,,,,,,,,,,,,,,12,20,1,,,1,,1,1,1,1,3,,,,,.050,.174,.200,.167
Cliff Pennington,2B/3B/SS,Angels,,4846,460060,pennicl01,$-26.13,,,,,,,,,,,,,,,,87,194,49,6,,3,2,23,21,3,1,16,,1,5,1,.253,.304,.330,.294
Shohei Ohtani,DH/SP,Angels,,11942,660271,,$-26.99,,,,,,,,,,,,,,,3.10,,,,,,,,,,,,,,,,,,,,
Kaleb Cowart,2B/3B,Angels,,6235,592230,,$-29.07,,,,,,,,,,,,,,,,50,102,23,5,1,3,1,18,11,4,2,10,1,3,,2,.225,.308,.382,.314
Shane Robinson,CF/LF,Angels,,3527,453203,robinsh01,$-33.97,,,,,,,,,,,,,,,,20,31,6,,,,1,7,1,2,,3,,,1,,.194,.257,.194,.254
Jared Foster,CF,Angels,,11657,664229,,$-35.77,,,,,,,,,,,,,,,,,,,,,,,,,,,,,,,,,,,
Michael Hermosillo,CF,Angels,,11619,641684,,$-35.77,,,,,,,,,,,,,,,,,,,,,,,,,,,,,,,,,,,
Jahmai Jones,CF,Angels,,11769,663330,,$-35.77,,,,,,,,,,,,,,,,,,,,,,,,,,,,,,,,,,,
Bo Way,CF,Angels,,11021,657444,,$-35.77,,,,,,,,,,,,,,,,,,,,,,,,,,,,,,,,,,,
Dustin Ackley,LF,Angels,,4296,554429,ackledu01,$-35.78,,,,,,,,,,,,,,,,,,,,,,,,,,,,,,,,,,,
Caleb Adams,LF,Angels,,11696,657422,,$-35.78,,,,,,,,,,,,,,,,,,,,,,,,,,,,,,,,,,,
Matt Williams,LF,Angels,,6982,607109,,$-35.78,,,,,,,,,,,,,,,,,,,,,,,,,,,,,,,,,,,
Matt Young,LF,Angels,,1867,457568,youngma02,$-35.78,,,,,,,,,,,,,,,,,,,,,,,,,,,,,,,,,,,
Jefry Marte,1B/3B/LF,Angels,,5687,527043,,$-35.89,,,,,,,,,,,,,,,,45,127,22,5,,4,1,10,14,1,,13,,4,1,,.173,.269,.307,.269
Nick Franklin,1B/OF,Angels,,4322,545338,frankni01,$-36.18,,,,,,,,,,,,,,,,66,106,19,3,1,2,2,9,12,2,,10,,3,,,.179,.269,.283,.273
Chad Hinshaw,RF,Angels,,10913,643364,,$-36.70,,,,,,,,,,,,,,,,,,,,,,,,,,,,,,,,,,,
Sherman Johnson,3B,Angels,,6387,582473,,$-36.85,,,,,,,,,,,,,,,,,,,,,,,,,,,,,,,,,,,
Roberto Baldoquin,SS,Angels,,10481,,,$-37.02,,,,,,,,,,,,,,,,,,,,,,,,,,,,,,,,,,,
David Fletcher,SS,Angels,,11343,664058,,$-37.02,,,,,,,,,,,,,,,,,,,,,,,,,,,,,,,,,,,
Rey Navarro,SS,Angels,,3573,519071,,$-37.02,,,,,,,,,,,,,,,,,,,,,,,,,,,,,,,,,,,
Luis Tejada,1B,Angels,,6473,593776,,$-38.04,,,,,,,,,,,,,,,,,,,,,,,,,,,,,,,,,,,
Matt Thaiss,1B,Angels,,11644,642136,,$-38.04,,,,,,,,,,,,,,,,,,,,,,,,,,,,,,,,,,,
Ramon Flores,CF/RF,Angels,,6082,570717,,$-39.61,,,,,,,,,,,,,,,,3,8,1,,,,,,1,,,,,,1,,.125,.111,.125,.100
