Player,Position,ProTeam,RotoTeam,RVid,MLBAMID,BDBID,RotoValue,pG,pIP,pH,pHR,pK,pBB,pIBB,pHB,pER,pWin,pL,pSav,pWHIP,pERA,pFIP,bG,bAB,bH,b2B,b3B,bHR,bRBOE,bR,bRBI,bSB,bCS,bBB,bIBB,bHBP,bSF,bSH,bAvg,bOBP,bSlg,bwOBA
Giancarlo Stanton,RF,Yankees,With the 5th Pick Truck Selects,4949,519317,stantmi03,$43.87,,,,,,,,,,,,,,,,159,597,168,32,,59,4,123,132,2,2,85,13,7,3,,.281,.376,.631,.421
Aaron Judge,RF,Yankees,Roto Value,10614,592450,,$41.23,,,,,,,,,,,,,,,,155,542,154,24,3,52,3,128,114,9,4,127,11,5,4,,.284,.422,.627,.441
J.D. Martinez,RF,Diamondbacks,SportsWiseGuy.com,5186,502110,martijd02,$27.20,,,,,,,,,,,,,,,,119,432,131,26,3,45,4,85,104,4,,53,8,,4,,.303,.376,.690,.446
Nelson Cruz,DH/RF,Mariners,The Seals Guys,4516,443558,cruzne02,$26.38,,,,,,,,,,,,,,,,155,556,160,28,,39,3,91,119,1,1,70,7,12,7,,.288,.375,.549,.394
Mookie Betts,RF,Red Sox,The Seals Guys,7057,605141,,$25.23,,,,,,,,,,,,,,,,153,628,166,46,2,24,5,101,102,26,3,77,9,2,5,,.264,.344,.459,.358
George Springer,CF/RF,Astros,The Seals Guys,5594,543807,,$22.20,,,,,,,,,,,,,,,,140,548,155,29,,34,7,112,85,5,7,64,1,11,4,,.283,.367,.522,.388
Bryce Harper,RF,Nationals,Texas BigSticks,5074,547180,harpebr03,$20.42,,,,,,,,,,,,,,,,111,420,134,27,1,29,1,95,87,4,2,68,11,1,3,,.319,.413,.595,.424
Domingo Santana,RF,Brewers,,6873,570267,,$19.20,,,,,,,,,,,,,,,,151,525,146,29,,30,3,88,85,15,4,73,2,6,3,,.278,.371,.505,.385
Andrew McCutchen,CF/RF,Pirates,Texas BigSticks,3354,457705,mccutan01,$18.72,,,,,,,,,,,,,,,,156,570,159,30,2,28,3,94,88,11,5,73,5,4,3,,.279,.363,.486,.371
Avisaíl García,DH/RF,White Sox,,1250,541645,garciav01,$14.27,,,,,,,,,,,,,,,,136,518,171,27,5,18,7,75,80,5,3,33,5,9,1,,.330,.380,.506,.393
Lorenzo Cain,CF/RF,Royals,Old Hoss,3160,456715,cainlo01,$13.99,,,,,,,,,,,,,,,,155,584,175,27,5,15,9,86,49,26,2,54,1,5,2,,.300,.363,.440,.374
Jay Bruce,RF,Indians,Moneyball,2879,457803,bruceja01,$13.73,,,,,,,,,,,,,,,,146,555,141,29,2,36,4,82,101,1,1,57,,2,3,,.254,.324,.508,.361
Nick Castellanos,3B/RF,Tigers,SportsWiseGuy.com,5597,592206,casteni01,$12.18,,,,,,,,,,,,,,,,157,614,167,36,10,26,5,73,101,4,5,41,,5,5,,.272,.320,.490,.351
Shin-Soo Choo,DH/RF,Rangers,,1109,425783,choosh01,$11.59,,,,,,,,,,,,,,,,149,544,142,20,1,22,5,96,78,12,3,77,1,7,5,3,.261,.355,.423,.354
Josh Reddick,LF/RF,Astros,,170,502210,reddijo01,$10.42,,,,,,,,,,,,,,,,134,477,150,34,4,13,6,77,82,7,3,43,1,,12,1,.314,.362,.484,.375
Yasiel Puig,RF,Dodgers,,6130,624577,puigya01,$10.36,,,,,,,,,,,,,,,,152,499,131,25,1,28,5,72,74,15,6,64,8,2,5,,.263,.346,.485,.363
Steven Souza Jr.,RF,Rays,,2518,519306,,$9.82,,,,,,,,,,,,,,,,148,523,125,21,2,30,2,78,78,16,4,84,2,7,1,2,.239,.350,.459,.359
Melky Cabrera,LF/RF,Royals,Roto Value,1869,466320,cabreme01,$7.20,,,,,,,,,,,,,,,,156,620,177,30,2,17,8,78,85,1,2,36,1,2,6,2,.285,.323,.423,.335
Miguel Sanó,3B/DH/RF,Twins,Dodger Blue,6302,593934,,$5.01,,,,,,,,,,,,,,,,114,424,112,15,2,28,4,75,77,,,54,5,4,1,,.264,.352,.507,.374
David Peralta,LF/RF,Diamondbacks,,9450,444482,,$4.58,,,,,,,,,,,,,,,,140,525,154,31,3,14,5,82,57,8,4,43,1,6,3,,.293,.352,.444,.356
Nomar Mazara,LF/RF,Rangers,Old Hoss,6744,608577,,$3.22,,,,,,,,,,,,,,,,148,554,140,30,2,20,4,64,101,2,2,55,6,4,3,,.253,.323,.422,.328
Matt Joyce,LF/RF,Athletics,,623,459964,joycema01,$1.16,,,,,,,,,,,,,,,,141,469,114,33,,25,,78,68,4,1,66,,2,7,,.243,.335,.473,.349
Scott Schebler,RF,Reds,,6564,594988,,$1.00,,,,,,,,,,,,,,,,141,473,110,25,2,30,2,63,67,5,3,39,5,14,5,,.233,.307,.484,.337
Kole Calhoun,RF,Angels,SportsWiseGuy.com,5340,594777,calhoko01,$1.00,,,,,,,,,,,,,,,,155,569,139,23,2,19,4,77,71,5,1,71,4,8,6,,.244,.333,.392,.327
Gerardo Parra,LF/RF,Rockies,,3692,467827,parrage01,$1.00,,,,,,,,,,,,,,,,115,392,121,24,1,10,1,56,71,2,5,20,,4,9,,.309,.341,.452,.340
Nick Markakis,RF,Braves,Big Chee,494,455976,markani01,$1.00,,,,,,,,,,,,,,,,160,593,163,39,1,8,5,76,76,,2,68,8,6,3,,.275,.354,.384,.332
Aaron Altherr,LF/RF,Phillies,,7372,571437,,$1.00,,,,,,,,,,,,,,,,107,372,101,24,5,19,4,58,65,5,4,32,2,7,1,,.272,.340,.516,.372
Max Kepler,RF,Twins,,6050,596146,,$-1.09,,,,,,,,,,,,,,,,147,511,124,32,2,19,5,67,69,6,1,47,2,6,3,1,.243,.312,.425,.330
Ben Gamel,LF/RF,Mariners,,5946,592325,,$-2.20,,,,,,,,,,,,,,,,134,509,140,27,5,11,7,68,59,4,1,36,1,1,3,1,.275,.322,.413,.334
Carlos González,RF,Rockies,Las Vegas Giants,3837,471865,gonzaca01,$-3.10,,,,,,,,,,,,,,,,136,470,123,34,,14,3,72,57,3,,56,3,2,6,,.262,.339,.423,.339
Matt Kemp,LF/RF,Dodgers,Las Vegas Giants,4676,461314,kempma01,$-3.64,,,,,,,,,,,,,,,,115,438,121,23,1,19,3,47,64,,2,27,5,,1,,.276,.318,.463,.338
Curtis Granderson,CF/LF/RF,Dodgers,Dodger Blue,321,434158,grandcu01,$-4.46,,,,,,,,,,,,,,,,147,449,95,24,3,26,6,74,64,6,2,71,2,4,3,,.212,.323,.452,.346
Mark Trumbo,DH/RF,Orioles,Poison Pills,1675,444432,trumbma01,$-4.47,,,,,,,,,,,,,,,,146,559,131,22,,23,7,79,65,1,,42,,1,1,,.234,.289,.397,.311
Hunter Pence,RF,Giants,JetBlack,3026,452254,pencehu01,$-5.58,,,,,,,,,,,,,,,,134,493,128,13,5,13,5,55,67,2,3,40,1,2,4,,.260,.315,.385,.316
José Bautista,DH/RF,Blue Jays,Las Vegas Giants,794,430832,bautijo02,$-5.80,,,,,,,,,,,,,,,,157,587,119,27,,23,2,92,65,6,3,84,3,8,7,,.203,.308,.366,.302
Hunter Renfroe,RF,Padres,,10146,592669,,$-5.84,,,,,,,,,,,,,,,,122,445,103,25,1,26,5,51,58,3,,27,1,6,1,,.231,.284,.467,.331
Mitch Haniger,CF/RF,Mariners,,6881,571745,,$-6.57,,,,,,,,,,,,,,,,96,369,104,25,2,16,3,58,47,5,4,31,,9,,1,.282,.351,.491,.370
Aaron Hicks,CF/LF/RF,Yankees,,5349,543305,hicksaa01,$-6.60,,,,,,,,,,,,,,,,88,301,80,18,,15,,54,52,10,5,51,,3,5,1,.266,.371,.475,.368
Randal Grichuk,CF/LF/RF,Cardinals,Old Hoss,5341,545341,,$-7.38,,,,,,,,,,,,,,,,122,412,98,25,3,22,1,53,59,6,1,26,3,2,2,,.238,.285,.473,.325
Hernán Pérez,3B/LF/RF,Brewers,Poison Pills,1245,541650,perezhe01,$-7.88,,,,,,,,,,,,,,,,136,432,112,19,3,14,3,47,51,13,4,20,1,,4,2,.259,.288,.414,.313
Nick Williams,LF/RF,Phillies,,10019,608384,,$-8.13,,,,,,,,,,,,,,,,83,313,90,14,4,12,3,45,55,1,2,20,,6,4,,.288,.338,.473,.356
Danny Valencia,1B/3B/RF,Mariners,The Seals Guys,1549,502143,valenda01,$-8.45,,,,,,,,,,,,,,,,130,450,115,19,3,15,8,54,66,2,2,40,,2,8,,.256,.314,.411,.330
Jarrod Dyson,CF/LF/RF,Mariners,,1417,502481,dysonja01,$-8.64,,,,,,,,,,,,,,,,111,346,87,13,3,5,2,56,30,28,7,28,2,10,2,4,.251,.321,.350,.315
Jason Heyward,CF/RF,Cubs,,1885,518792,heywaja01,$-9.28,,,,,,,,,,,,,,,,126,432,112,15,4,11,5,59,59,4,4,41,1,3,2,2,.259,.325,.389,.324
Chris Owings,2B/CF/RF/SS,Diamondbacks,The Seals Guys,3674,572008,owingch01,$-9.41,,,,,,,,,,,,,,,,97,362,97,25,1,12,5,41,51,12,2,17,,1,4,2,.268,.298,.442,.336
Jorge Bonifacio,RF,Royals,,7396,593528,,$-10.24,,,,,,,,,,,,,,,,113,384,98,15,1,17,,55,40,1,1,35,,2,1,,.255,.320,.432,.328
Lonnie Chisenhall,RF,Indians,,1070,502082,chiselo01,$-10.89,,,,,,,,,,,,,,,,82,236,68,17,1,12,1,34,53,2,2,25,2,3,3,3,.288,.356,.521,.376
Brandon Drury,2B/3B/LF/RF,Diamondbacks,Texas BigSticks,5891,592273,,$-11.25,,,,,,,,,,,,,,,,135,445,119,37,2,13,4,41,63,1,1,28,1,5,2,,.267,.317,.447,.337
Nori Aoki,LF/RF,Mets,,5569,493114,aokino01,$-11.68,,,,,,,,,,,,,,,,109,336,93,20,2,5,2,48,35,10,2,29,1,3,5,1,.277,.334,.393,.330
Mikie Mahtook,CF/LF/RF,Tigers,,6900,543484,,$-12.12,,,,,,,,,,,,,,,,109,348,96,15,6,12,7,50,38,6,,23,,6,2,,.276,.330,.457,.362
Matt Olson,1B/RF,Athletics,,9384,621566,,$-13.11,,,,,,,,,,,,,,,,59,189,49,2,,24,,33,45,,,22,1,5,,,.259,.352,.651,.416
Seth Smith,LF/RF,Orioles,,3845,452234,smithse01,$-13.88,,,,,,,,,,,,,,,,111,330,85,19,,13,2,50,32,2,,36,3,6,1,,.258,.340,.433,.343
Robbie Grossman,DH/LF/RF,Twins,,3351,543257,grossro01,$-14.47,,,,,,,,,,,,,,,,119,382,94,22,1,9,1,62,45,3,1,67,,3,2,2,.246,.360,.380,.337
Gregory Polanco,LF/RF,Pirates,Poison Pills,5723,570256,,$-14.50,,,,,,,,,,,,,,,,108,379,95,20,,11,1,39,35,8,1,27,4,3,1,,.251,.305,.391,.308
Ezequiel Carrera,LF/RF,Blue Jays,,4331,485567,carreez01,$-15.08,,,,,,,,,,,,,,,,131,287,81,10,1,8,1,38,20,10,1,30,,3,,5,.282,.351,.408,.350
Carlos Beltrán,DH/RF,Astros,Las Vegas Giants,2172,136860,beltrca01,$-15.25,,,,,,,,,,,,,,,,129,467,108,29,,14,5,60,51,,,33,3,3,6,,.231,.283,.383,.297
Ben Zobrist,2B/LF/RF,Cubs,Roto Value,578,450314,zobribe01,$-15.45,,,,,,,,,,,,,,,,128,435,101,20,3,12,7,58,50,2,2,54,2,2,3,2,.232,.317,.375,.319
Brandon Moss,1B/DH/LF/RF,Royals,SportsWiseGuy.com,3401,461235,mossbr01,$-16.49,,,,,,,,,,,,,,,,118,362,75,14,,22,,41,50,2,,37,,,2,,.207,.279,.428,.307
Ben Revere,CF/LF/RF,Angels,,1559,519184,reverbe01,$-16.98,,,,,,,,,,,,,,,,109,291,80,13,2,1,6,37,20,21,6,15,,,2,,.275,.308,.344,.316
Brian Goodwin,CF/LF/RF,Nationals,,6504,571718,,$-17.53,,,,,,,,,,,,,,,,74,251,63,21,1,13,3,41,30,6,,23,2,1,3,,.251,.313,.498,.357
Chad Pinder,DH/RF/SS,Athletics,,10889,640461,,$-18.23,,,,,,,,,,,,,,,,87,282,67,15,1,15,5,36,42,2,1,18,,5,3,,.238,.292,.457,.336
Stephen Piscotty,RF,Athletics,Texas BigSticks,6487,572039,,$-18.25,,,,,,,,,,,,,,,,107,341,80,16,1,9,2,40,39,3,6,52,2,5,3,,.235,.342,.367,.316
Gregor Blanco,CF/LF/RF,Diamondbacks,,1861,453923,blancgr01,$-21.41,,,,,,,,,,,,,,,,90,224,55,10,3,3,1,43,13,15,1,31,,,,1,.246,.336,.357,.330
Alex Presley,CF/RF,Tigers,,3388,502100,preslal01,$-21.73,,,,,,,,,,,,,,,,71,245,77,10,3,3,1,30,20,5,,15,,,,3,.314,.350,.416,.349
Gorkys Hernández,CF/LF/RF,Giants,,3352,491676,hernago01,$-22.31,,,,,,,,,,,,,,,,128,310,79,20,1,,3,40,22,12,4,31,3,3,2,2,.255,.325,.326,.304
Yasmany Tomás,LF/RF,Diamondbacks,Old Hoss,10509,630111,,$-23.86,,,,,,,,,,,,,,,,47,166,40,11,1,8,3,19,32,,,13,,,1,,.241,.294,.464,.340
John Jaso,1B/RF,Pirates,,4900,444379,jasojo01,$-25.88,,,,,,,,,,,,,,,,126,256,54,19,,10,2,28,35,1,1,40,2,5,1,,.211,.328,.402,.326
José Osuna,1B/LF/RF,Pirates,,10677,591741,,$-26.01,,,,,,,,,,,,,,,,104,215,50,13,4,7,1,31,30,,,9,,2,1,,.233,.269,.428,.302
Joey Rickard,CF/LF/RF,Orioles,,6924,572073,,$-26.08,,,,,,,,,,,,,,,,111,261,63,15,,4,3,29,19,8,1,9,,4,1,2,.241,.274,.345,.290
Alen Hanson,2B/3B/RF,White Sox,,6506,593700,,$-26.14,,,,,,,,,,,,,,,,106,217,48,9,3,4,2,36,11,11,3,12,,1,3,1,.221,.261,.346,.279
Raimel Tapia,CF/RF,Rockies,,10688,606132,,$-26.42,,,,,,,,,,,,,,,,70,160,46,12,2,2,,27,16,5,2,8,1,2,,1,.287,.327,.425,.330
Jarrett Parker,LF/RF,Giants,,5430,592620,,$-27.25,,,,,,,,,,,,,,,,51,166,41,12,2,4,,14,23,2,1,10,2,1,,,.247,.294,.416,.304
Jesse Winker,DH/RF,Reds,,6903,608385,,$-27.28,,,,,,,,,,,,,,,,47,121,36,7,,7,1,21,15,1,1,15,,,,1,.298,.372,.529,.395
Ichiro Suzuki,RF,Marlins,,4362,400085,suzukic01,$-27.39,,,,,,,,,,,,,,,,136,196,50,6,,3,,19,20,1,1,17,1,1,,1,.255,.316,.332,.291
Brandon Guyer,LF/RF,Indians,,2691,446386,guyerbr01,$-27.56,,,,,,,,,,,,,,,,70,165,39,7,1,2,,23,20,2,,15,,8,2,2,.236,.323,.327,.300
Derek Fisher,LF/RF,Astros,,10858,605233,,$-27.74,,,,,,,,,,,,,,,,53,146,31,4,1,5,2,21,17,3,3,17,1,3,,,.212,.307,.356,.302
Abraham Almonte,LF/RF,Indians,,318,501659,almonab01,$-28.00,,,,,,,,,,,,,,,,69,172,40,8,3,3,2,26,14,2,1,20,,1,1,1,.233,.313,.366,.313
Patrick Kivlehan,3B/RF,Reds,,9462,623182,,$-28.11,,,,,,,,,,,,,,,,115,178,37,5,1,9,2,23,26,1,2,22,1,3,1,,.208,.304,.399,.313
Jabari Blash,RF,Yankees,,5681,518466,,$-28.45,,,,,,,,,,,,,,,,61,164,35,6,,5,2,24,16,1,2,28,,2,1,,.213,.333,.341,.314
Michael Saunders,LF/RF,Blue Jays,Las Vegas Giants,4341,459431,saundmi01,$-28.61,,,,,,,,,,,,,,,,73,218,44,9,2,6,1,26,21,,1,15,2,1,,,.202,.256,.344,.263
Peter Bourjos,CF/LF/RF,Rays,,1703,488721,bourjpe01,$-28.82,,,,,,,,,,,,,,,,100,188,42,9,3,5,1,27,15,5,4,12,,1,1,1,.223,.271,.383,.286
Adam Eaton,CF/RF,Nationals,JetBlack,5316,594809,eatonad02,$-28.86,,,,,,,,,,,,,,,,23,91,27,7,1,2,1,24,13,3,1,14,,1,1,,.297,.393,.462,.386
Craig Gentry,CF/LF/RF,Orioles,,4517,502226,gentrcr01,$-30.87,,,,,,,,,,,,,,,,77,101,26,5,1,2,,17,11,5,4,11,,1,1,3,.257,.325,.386,.313
Willy Garcia,RF,White Sox,,5778,591994,,$-31.14,,,,,,,,,,,,,,,,44,105,25,5,3,2,1,15,12,,,11,,,2,1,.238,.303,.400,.315
Jim Adduci,RF,Tigers,,2717,451192,adducji02,$-31.53,,,,,,,,,,,,,,,,29,83,20,6,2,1,2,14,10,1,1,10,,,,,.241,.323,.398,.335
Mac Williamson,LF/RF,Giants,,6909,607776,,$-32.63,,,,,,,,,,,,,,,,28,68,16,2,,3,2,8,6,1,1,5,1,,,,.235,.288,.397,.316
Ryan Raburn,LF/RF,Nationals,,1261,430605,raburry01,$-33.16,,,,,,,,,,,,,,,,25,65,17,1,2,2,,7,6,,1,4,,,,,.262,.304,.431,.312
Mark Canha,1B/LF/RF,Athletics,,5757,592192,,$-33.17,,,,,,,,,,,,,,,,57,173,36,13,1,5,,16,14,2,,7,,6,1,,.208,.262,.382,.282
Harrison Bader,CF/RF,Cardinals,,11417,664056,,$-33.90,,,,,,,,,,,,,,,,32,85,20,3,,3,,10,10,2,1,5,1,1,1,,.235,.283,.376,.284
Rymer Liriano,RF,White Sox,,3999,542642,,$-34.32,,,,,,,,,,,,,,,,21,41,9,2,,1,,4,6,1,,5,,,,,.220,.304,.341,.297
César Puello,RF,Rays,,5253,527049,,$-34.60,,,,,,,,,,,,,,,,17,34,7,,,,,6,3,2,,4,,1,,,.206,.308,.206,.264
Austin Hays,RF,Orioles,,11878,669720,,$-34.65,,,,,,,,,,,,,,,,20,60,13,3,,1,1,4,8,,,2,,,1,,.217,.238,.317,.256
Andre Ethier,RF,Dodgers,,4708,444843,ethiean01,$-34.86,,,,,,,,,,,,,,,,22,34,8,1,,2,,3,3,,,4,1,,,,.235,.316,.441,.320
Justin Ruggiano,RF,Giants,,4910,448605,ruggiju01,$-34.95,,,,,,,,,,,,,,,,19,60,13,1,,2,1,2,4,1,1,1,,1,1,,.217,.238,.333,.259
Cam Perkins,RF,Mariners,,10114,573088,,$-35.02,,,,,,,,,,,,,,,,42,88,16,5,,1,3,9,8,,,5,,2,2,,.182,.237,.273,.256
Mason Williams,RF,Yankees,,5853,592863,,$-35.07,,,,,,,,,,,,,,,,5,16,4,,,,,3,1,2,,1,,,,,.250,.294,.250,.282
Carlos Moncrief,RF,Giants,,6392,519037,,$-35.49,,,,,,,,,,,,,,,,28,38,8,1,,,,4,5,,,3,,,2,,.211,.256,.237,.224
Franklin Gutiérrez,CF/RF,Dodgers,,4333,429711,gutiefr01,$-36.33,,,,,,,,,,,,,,,,35,56,13,3,,1,,8,8,,1,7,,,,,.232,.317,.339,.290
Greg Allen,CF/RF,Indians,,11050,656185,,$-36.34,,,,,,,,,,,,,,,,25,35,8,1,,1,,7,6,1,,2,,1,1,,.229,.282,.343,.282
Travis Taijeron,RF,Mets,,9395,607369,,$-36.46,,,,,,,,,,,,,,,,26,52,9,2,,1,,3,3,,,5,,2,,,.173,.271,.269,.251
Micker Adolfo,RF,White Sox,,11906,650520,,$-36.70,,,,,,,,,,,,,,,,,,,,,,,,,,,,,,,,,,,
Beau Amaral,RF,Reds,,6482,572679,,$-36.70,,,,,,,,,,,,,,,,,,,,,,,,,,,,,,,,,,,
Andrew Aplin,RF,Mariners,,9996,545331,,$-36.70,,,,,,,,,,,,,,,,,,,,,,,,,,,,,,,,,,,
Aristides Aquino,RF,Reds,,10680,606157,,$-36.70,,,,,,,,,,,,,,,,,,,,,,,,,,,,,,,,,,,
Oswaldo Arcia,LF/RF,Diamondbacks,,5532,542455,arciaos01,$-36.70,,,,,,,,,,,,,,,,,,,,,,,,,,,,,,,,,,,
Dariel Álvarez,RF,Orioles,,7563,645848,,$-36.70,,,,,,,,,,,,,,,,,,,,,,,,,,,,,,,,,,,
Wuilmer Becerra,RF,Mets,,11392,610141,,$-36.70,,,,,,,,,,,,,,,,,,,,,,,,,,,,,,,,,,,
Will Benson,RF,Indians,,11809,666181,,$-36.70,,,,,,,,,,,,,,,,,,,,,,,,,,,,,,,,,,,
Wynton Bernard,RF,Giants,,6959,592144,,$-36.70,,,,,,,,,,,,,,,,,,,,,,,,,,,,,,,,,,,
Alex Castellanos,RF,Orioles,,5357,543008,casteal01,$-36.70,,,,,,,,,,,,,,,,,,,,,,,,,,,,,,,,,,,
Hunter Cole,RF,Giants,,11732,607500,,$-36.70,,,,,,,,,,,,,,,,,,,,,,,,,,,,,,,,,,,
Gene Cone,RF,Mets,,11798,669950,,$-36.70,,,,,,,,,,,,,,,,,,,,,,,,,,,,,,,,,,,
Collin Cowgill,RF,Padres,,3704,518577,cowgico01,$-36.70,,,,,,,,,,,,,,,,,,,,,,,,,,,,,,,,,,,
Dylan Cozens,RF,Phillies,,11603,622226,,$-36.70,,,,,,,,,,,,,,,,,,,,,,,,,,,,,,,,,,,
Jonathan Davis,RF,Blue Jays,,11784,641505,,$-36.70,,,,,,,,,,,,,,,,,,,,,,,,,,,,,,,,,,,
Chris Denorfia,RF,Rockies,,3996,456121,denorch01,$-36.70,,,,,,,,,,,,,,,,,,,,,,,,,,,,,,,,,,,
Chris Dominguez,RF,Cubs,,5354,458689,,$-36.70,,,,,,,,,,,,,,,,,,,,,,,,,,,,,,,,,,,
Eric Filia,RF,Mariners,,11679,596107,,$-36.70,,,,,,,,,,,,,,,,,,,,,,,,,,,,,,,,,,,
Jeff Francoeur,LF/RF,Braves,,2206,425796,francje02,$-36.70,,,,,,,,,,,,,,,,,,,,,,,,,,,,,,,,,,,
Isaac Galloway,RF,Marlins,,2020,543194,,$-36.70,,,,,,,,,,,,,,,,,,,,,,,,,,,,,,,,,,,
Mike Gerber,RF,Tigers,,11394,,,$-36.70,,,,,,,,,,,,,,,,,,,,,,,,,,,,,,,,,,,
Granden Goetzman,RF,Rays,,10153,605248,,$-36.70,,,,,,,,,,,,,,,,,,,,,,,,,,,,,,,,,,,
Gabriel Guerrero,RF,Reds,,10164,602115,,$-36.70,,,,,,,,,,,,,,,,,,,,,,,,,,,,,,,,,,,
Slade Heathcott,RF,Giants,,6293,571761,,$-36.70,,,,,,,,,,,,,,,,,,,,,,,,,,,,,,,,,,,
Chad Hinshaw,RF,Angels,,10913,643364,,$-36.70,,,,,,,,,,,,,,,,,,,,,,,,,,,,,,,,,,,
Alex Jackson,RF,Braves,,10634,656577,,$-36.70,,,,,,,,,,,,,,,,,,,,,,,,,,,,,,,,,,,
Eloy Jiménez,RF,White Sox,,11672,650391,,$-36.70,,,,,,,,,,,,,,,,,,,,,,,,,,,,,,,,,,,
Ben Johnson,RF,Royals,,11760,,,$-36.70,,,,,,,,,,,,,,,,,,,,,,,,,,,,,,,,,,,
Junior Lake,RF,Red Sox,,2657,516809,lakeju01,$-36.70,,,,,,,,,,,,,,,,,,,,,,,,,,,,,,,,,,,
Ryan Lollis,RF,Giants,,5828,489067,,$-36.70,,,,,,,,,,,,,,,,,,,,,,,,,,,,,,,,,,,
David Lough,RF,Tigers,,1437,518953,loughda01,$-36.70,,,,,,,,,,,,,,,,,,,,,,,,,,,,,,,,,,,
Derrick Loveless,RF,Blue Jays,,11504,596023,,$-36.70,,,,,,,,,,,,,,,,,,,,,,,,,,,,,,,,,,,
Eddy Martinez,RF,Cubs,,11707,666558,,$-36.70,,,,,,,,,,,,,,,,,,,,,,,,,,,,,,,,,,,
Tate Matheny,RF,Red Sox,,11786,621469,,$-36.70,,,,,,,,,,,,,,,,,,,,,,,,,,,,,,,,,,,
Matt McBride,RF,Athletics,,1099,473724,mcbrima02,$-36.70,,,,,,,,,,,,,,,,,,,,,,,,,,,,,,,,,,,
Joe McCarthy,RF,Rays,,11767,663411,,$-36.70,,,,,,,,,,,,,,,,,,,,,,,,,,,,,,,,,,,
Billy McKinney,RF,Yankees,,7579,641856,,$-36.70,,,,,,,,,,,,,,,,,,,,,,,,,,,,,,,,,,,
Johan Mieses,RF,Dodgers,,11440,644407,,$-36.70,,,,,,,,,,,,,,,,,,,,,,,,,,,,,,,,,,,
Ian Miller,RF,Mariners,,10642,641878,,$-36.70,,,,,,,,,,,,,,,,,,,,,,,,,,,,,,,,,,,
Steven Moyà,RF,Tigers,,1283,570615,,$-36.70,,,,,,,,,,,,,,,,,,,,,,,,,,,,,,,,,,,
Micah Owings,RF,Mariners,,2779,452249,owingmi01,$-36.70,,,,,,,,,,,,,,,,,,,,,,,,,,,,,,,,,,,
Mark Payton,RF,Yankees,,11180,592622,,$-36.70,,,,,,,,,,,,,,,,,,,,,,,,,,,,,,,,,,,
Wily Pena,RF,Indians,,11697,,,$-36.70,,,,,,,,,,,,,,,,,,,,,,,,,,,,,,,,,,,
Harold Ramírez,RF,Blue Jays,,10104,623912,,$-36.70,,,,,,,,,,,,,,,,,,,,,,,,,,,,,,,,,,,
Henry Ramos,RF,Dodgers,,6544,592656,,$-36.70,,,,,,,,,,,,,,,,,,,,,,,,,,,,,,,,,,,
Mel Rojas,RF,Braves,,11795,,,$-36.70,,,,,,,,,,,,,,,,,,,,,,,,,,,,,,,,,,,
Joantgel Segovia,RF,Brewers,,11743,650694,,$-36.70,,,,,,,,,,,,,,,,,,,,,,,,,,,,,,,,,,,
Moises Sierra,RF,Marlins,,774,501213,sierrmo01,$-36.70,,,,,,,,,,,,,,,,,,,,,,,,,,,,,,,,,,,
Jordan Smith,RF,Indians,,11692,,,$-36.70,,,,,,,,,,,,,,,,,,,,,,,,,,,,,,,,,,,
Travis Snider,RF,Rangers,,783,501983,snidetr01,$-36.70,,,,,,,,,,,,,,,,,,,,,,,,,,,,,,,,,,,
Michael Suchy,RF,Pirates,,11735,,,$-36.70,,,,,,,,,,,,,,,,,,,,,,,,,,,,,,,,,,,
Aneury Tavarez,RF,Orioles,,9393,606477,,$-36.70,,,,,,,,,,,,,,,,,,,,,,,,,,,,,,,,,,,
Kyle Waldrop,RF,Mariners,,5268,592835,,$-36.70,,,,,,,,,,,,,,,,,,,,,,,,,,,,,,,,,,,
Adam Walker,RF,Braves,,10235,608724,,$-36.70,,,,,,,,,,,,,,,,,,,,,,,,,,,,,,,,,,,
Justin Williams,RF,Rays,,11935,642211,,$-36.70,,,,,,,,,,,,,,,,,,,,,,,,,,,,,,,,,,,
Rhett Wiseman,RF,Nationals,,11687,621443,,$-36.70,,,,,,,,,,,,,,,,,,,,,,,,,,,,,,,,,,,
Jorge Soler,LF/RF,Royals,,6129,624585,,$-36.73,,,,,,,,,,,,,,,,35,97,14,5,,2,,7,6,,,12,1,1,,,.144,.245,.258,.229
Paulo Orlando,CF/RF,Royals,,1439,449181,,$-36.83,,,,,,,,,,,,,,,,39,86,17,3,,2,1,9,6,1,1,1,,2,,,.198,.225,.302,.239
Ian Parmley,RF,Blue Jays,,11855,622210,,$-36.94,,,,,,,,,,,,,,,,3,3,,,,,,,,,,,,,,1,,,,
Mike Aviles,3B/RF/SS,Marlins,,1400,449107,avilemi01,$-37.15,,,,,,,,,,,,,,,,37,86,20,2,,1,1,5,8,,,6,2,2,,3,.233,.289,.291,.271
Travis Jankowski,CF/RF,Padres,,6470,608671,,$-37.27,,,,,,,,,,,,,,,,27,75,14,2,,,,10,1,4,,9,,1,,2,.187,.276,.213,.251
Ryan LaMarre,RF,Athletics,,4958,534606,,$-37.27,,,,,,,,,,,,,,,,3,7,,,,,,,,,,1,,,,,,.125,,.087
Brett Eibner,CF/RF,Dodgers,,5205,518649,,$-37.58,,,,,,,,,,,,,,,,17,33,6,,,2,,3,6,,,2,,1,,,.182,.250,.364,.269
Chris Coghlan,2B/LF/RF,Blue Jays,,2009,458085,coghlch01,$-38.05,,,,,,,,,,,,,,,,36,75,15,2,,1,,7,5,,,9,,2,1,1,.200,.295,.267,.264
Rob Refsnyder,1B/2B/RF,Indians,,9551,608701,,$-38.60,,,,,,,,,,,,,,,,52,88,15,2,1,,2,8,,4,1,8,1,1,,,.170,.247,.216,.237
Jake Smolinski,CF/RF,Athletics,,5477,519295,,$-39.28,,,,,,,,,,,,,,,,16,27,7,1,,,,1,,,,1,,1,,,.259,.310,.296,.278
Kirk Nieuwenhuis,CF/RF,Brewers,,2179,543590,nieuwki01,$-39.42,,,,,,,,,,,,,,,,16,26,3,1,,1,,3,1,,,4,,1,,,.115,.258,.269,.247
Michael Bourn,CF/LF/RF,Orioles,,3001,456422,bournmi01,$-39.48,,,,,,,,,,,,,,,,,,,,,,,,,,,,,,,,,,,
Tyler Holt,CF/RF,Dodgers,,6420,534627,,$-39.48,,,,,,,,,,,,,,,,,,,,,,,,,,,,,,,,,,,
Jordan Patterson,1B/RF,Rockies,,10703,641958,,$-39.48,,,,,,,,,,,,,,,,,,,,,,,,,,,,,,,,,,,
Trayce Thompson,CF/LF/RF,Dodgers,,932,572204,,$-39.57,,,,,,,,,,,,,,,,27,49,6,2,1,1,,6,2,,,6,1,,,,.122,.218,.265,.211
Ramon Flores,CF/RF,Angels,,6082,570717,,$-39.61,,,,,,,,,,,,,,,,3,8,1,,,,,,1,,,,,,1,,.125,.111,.125,.100
