Player,Position,ProTeam,RotoTeam,RVid,MLBAMID,BDBID,RotoValue,bG,bAB,bH,b2B,b3B,bHR,bRBOE,bR,bRBI,bSB,bCS,bBB,bIBB,bHBP,bSF,bSH,bAvg,bOBP,bSlg,bwOBA,pG,pIP,pH,pHR,pK,pBB,pIBB,pHB,pER,pWin,pL,pSav,pWHIP,pERA,pFIP
Chris Davis,1B/DH/RF,Orioles,SportsWiseGuy.com,4462,448801,davisch02,$44.82,160,584,167,42,1,53,,103,138,4,1,72,12,10,7,,.286,.370,.634,.414,,,,,,,,,,,,,,,
Paul Goldschmidt,1B,Diamondbacks,Dodger Blue,3648,502671,goldspa01,$42.66,160,602,182,36,3,36,,103,125,15,7,99,19,3,5,,.302,.401,.551,.401,,,,,,,,,,,,,,,
Matt Carpenter,1B/2B/3B/OF,Cardinals,With the 5th Pick Truck Selects,5070,572761,carpema01,$26.67,157,626,199,55,7,11,,126,78,3,3,72,1,9,7,3,.318,.391,.481,.380,,,,,,,,,,,,,,,
Edwin Encarnación,1B/DH,Blue Jays,Moneyball,753,429665,encared01,$25.92,142,530,144,29,1,36,,90,104,7,1,82,7,4,5,,.272,.370,.534,.385,,,,,,,,,,,,,,,
Freddie Freeman,1B,Braves,SportsWiseGuy.com,1836,518692,freemfr01,$25.36,147,551,176,27,2,23,,89,109,1,,66,10,7,5,,.319,.396,.501,.386,,,,,,,,,,,,,,,
Joey Votto,1B,Reds,Moneyball,2825,458015,vottojo01,$22.28,162,581,178,30,3,24,,101,73,6,3,135,19,4,6,,.306,.437,.492,.401,,,,,,,,,,,,,,,
Michael Cuddyer,1B/RF,Rockies,JetBlack,1578,150212,cuddymi01,$21.14,130,489,162,31,3,20,,74,84,10,3,46,5,2,3,,.331,.389,.530,.396,,,,,,,,,,,,,,,
Mike Napoli,1B/C,Red Sox,Dodger Blue,1665,435063,napolmi01,$20.69,139,498,129,38,2,23,,79,92,1,1,73,3,6,1,,.259,.360,.482,.364,,,,,,,,,,,,,,,
Eric Hosmer,1B,Royals,Las Vegas Giants,5082,543333,hosmeer01,$19.10,159,623,188,34,3,17,,86,79,11,4,51,4,1,4,1,.302,.353,.448,.350,,,,,,,,,,,,,,,
Prince Fielder,1B,Tigers,Old Hoss,3131,425902,fieldpr01,$17.95,162,624,174,36,,25,,82,106,1,1,75,5,9,4,,.279,.362,.457,.356,,,,,,,,,,,,,,,
Carlos Santana,1B/C/DH,Indians,Las Vegas Giants,1047,467793,santaca01,$17.47,154,541,145,39,1,20,,75,74,3,1,93,6,4,4,,.268,.377,.455,.363,,,,,,,,,,,,,,,
Mark Trumbo,1B/DH/LF/RF,Angels,With the 5th Pick Truck Selects,1675,444432,trumbma01,$15.32,159,620,145,30,2,34,,85,100,5,2,54,6,,4,,.234,.294,.453,.318,,,,,,,,,,,,,,,
Buster Posey,1B/C,Giants,Dodger Blue,4108,457763,poseybu01,$15.30,148,520,153,34,1,15,,61,72,2,1,60,8,8,7,,.294,.371,.450,.356,,,,,,,,,,,,,,,
Adrián González,1B,Dodgers,Old Hoss,3959,408236,gonzaad01,$14.92,157,583,171,32,,22,,69,100,1,,47,6,1,10,,.293,.342,.461,.345,,,,,,,,,,,,,,,
Allen Craig,1B/LF/RF,Cardinals,JetBlack,3529,501800,craigal01,$13.36,134,508,160,29,2,13,,71,97,2,,40,2,10,5,,.315,.373,.457,.364,,,,,,,,,,,,,,,
Brandon Moss,1B/RF,Athletics,Big Chee,3401,461235,mossbr01,$12.07,145,446,114,23,3,30,,73,87,4,2,50,3,6,3,,.256,.337,.522,.364,,,,,,,,,,,,,,,
Joe Mauer,1B/C/DH,Twins,Moneyball,1521,408045,mauerjo01,$10.92,113,445,144,35,,11,,62,47,,1,61,7,,2,,.324,.404,.476,.382,,,,,,,,,,,,,,,
Brandon Belt,1B,Giants,,4113,474832,beltbr01,$8.11,150,509,147,39,4,17,,76,67,5,2,52,4,6,3,1,.289,.359,.481,.363,,,,,,,,,,,,,,,
Kendrys Morales,1B/DH,Mariners,Old Hoss,1672,434778,moralke01,$7.34,156,602,167,34,,23,,64,80,,,49,6,5,1,,.277,.336,.449,.340,,,,,,,,,,,,,,,
Adam Lind,1B/DH,Blue Jays,,800,452252,lindad01,$6.67,143,465,134,26,1,23,,67,67,1,,51,5,1,4,,.288,.357,.497,.366,,,,,,,,,,,,,,,
Billy Butler,1B/DH,Royals,Big Chee,1375,456714,butlebi03,$5.22,162,582,168,27,,15,,62,82,,,79,11,3,4,,.289,.374,.412,.345,,,,,,,,,,,,,,,
James Loney,1B,Rays,,4640,425766,loneyja01,$4.12,158,549,164,33,,13,,54,75,3,1,44,6,,4,1,.299,.348,.430,.339,,,,,,,,,,,,,,,
Adam Dunn,1B/DH,White Sox,With the 5th Pick Truck Selects,2488,276055,dunnad01,$3.71,149,525,115,15,,34,,60,86,1,1,76,7,3,3,,.219,.320,.442,.327,,,,,,,,,,,,,,,
Anthony Rizzo,1B,Cubs,Dodger Blue,113,519203,rizzoan01,$3.53,160,606,141,40,2,23,,71,80,6,5,76,7,6,2,,.233,.323,.419,.321,,,,,,,,,,,,,,,
Chris Carter,1B/DH/LF,Astros,The Seals Guys,4819,474892,cartech02,$2.69,148,506,113,24,2,29,,64,82,2,,70,1,4,5,,.223,.320,.451,.334,,,,,,,,,,,,,,,
Todd Frazier,1B/3B,Reds,The Seals Guys,2863,453943,frazito01,$2.53,150,531,124,29,3,19,,63,73,6,5,50,1,14,3,2,.234,.313,.407,.315,,,,,,,,,,,,,,,
Nick Swisher,1B/RF,Indians,Moneyball,346,430897,swishni01,$1.00,145,549,135,27,2,22,,74,63,1,,77,3,4,4,,.246,.341,.423,.335,,,,,,,,,,,,,,,
Justin Morneau,1B/DH,Pirates,Moneyball,1529,408047,morneju01,$1.00,152,572,148,36,,17,,62,77,,,50,4,7,6,,.259,.323,.411,.319,,,,,,,,,,,,,,,
Adam LaRoche,1B,Nationals,Texas BigSticks,3650,425560,larocad01,$1.00,152,511,121,19,3,20,,70,62,4,1,72,10,3,4,,.237,.332,.403,.320,,,,,,,,,,,,,,,
Mark Reynolds,1B/3B/DH,Yankees,,3664,448602,reynoma01,$1.00,135,445,98,14,,21,,55,67,3,1,51,1,5,3,,.220,.306,.393,.308,,,,,,,,,,,,,,,
Yan Gomes,1B/C,Indians,,5592,543228,gomesya01,$1.00,88,293,86,18,2,11,,45,38,2,,18,,7,4,,.294,.345,.481,.358,,,,,,,,,,,,,,,
Mitch Moreland,1B,Rangers,,4519,519048,morelmi01,$0.00,147,462,107,24,1,23,,60,60,,,45,1,3,8,,.232,.299,.437,.316,,,,,,,,,,,,,,,
Matt Adams,1B,Cardinals,,5355,571431,adamsma01,$-0.95,108,296,84,14,,17,,46,51,,1,23,,,,,.284,.335,.503,.360,,,,,,,,,,,,,,,
Justin Smoak,1B,Mariners,,4469,475253,smoakju01,$-3.30,131,454,108,19,,20,,53,50,,,64,1,2,1,,.238,.334,.412,.330,,,,,,,,,,,,,,,
Michael Young,1B/3B/DH,Dodgers,JetBlack,4482,276545,youngmi02,$-3.48,147,519,145,26,5,8,,52,46,1,,43,4,1,2,,.279,.335,.395,.321,,,,,,,,,,,,,,,
Todd Helton,1B,Rockies,,3795,115732,heltoto01,$-4.45,124,397,99,22,1,15,,41,61,,,40,1,,5,,.249,.314,.423,.320,,,,,,,,,,,,,,,
Albert Pujols,1B/DH,Angels,Big Poison,3503,405395,pujolal01,$-4.83,99,391,101,19,,17,,49,64,1,1,40,8,5,7,,.258,.330,.437,.326,,,,,,,,,,,,,,,
Lyle Overbay,1B,Yankees,,738,407489,overbly01,$-5.23,142,445,107,24,1,14,,43,59,2,,36,,,4,,.240,.295,.393,.302,,,,,,,,,,,,,,,
Yonder Alonso,1B,Padres,,2819,475174,alonsyo01,$-6.95,97,334,94,11,,6,,34,45,6,,32,5,2,7,,.281,.341,.368,.316,,,,,,,,,,,,,,,
Ryan Howard,1B,Phillies,RotoValue,2318,429667,howarry01,$-9.62,80,286,76,20,2,11,,34,43,,,23,4,2,6,,.266,.319,.465,.331,,,,,,,,,,,,,,,
Juan Francisco,1B/3B,Brewers,,2835,464433,francju02,$-11.76,124,348,79,12,1,18,,36,48,,2,32,3,3,2,,.227,.296,.422,.307,,,,,,,,,,,,,,,
Conor Gillaspie,1B/3B,White Sox,,4135,543216,gillaco01,$-11.96,134,408,100,14,3,13,,46,40,,1,37,4,1,6,,.245,.305,.390,.300,,,,,,,,,,,,,,,
Brett Wallace,1B,Astros,,758,477165,wallabr01,$-12.89,79,262,58,14,1,13,,35,36,1,1,18,,5,,,.221,.284,.431,.309,,,,,,,,,,,,,,,
Garrett Jones,1B/RF,Pirates,Las Vegas Giants,3397,434540,jonesga02,$-13.20,144,403,94,26,2,15,,41,51,2,,31,,2,4,,.233,.289,.419,.307,,,,,,,,,,,,,,,
Paul Konerko,1B/DH,White Sox,RotoValue,893,117244,konerpa01,$-13.39,126,467,114,16,,12,,41,54,,,45,2,4,4,,.244,.313,.355,.298,,,,,,,,,,,,,,,
Gaby Sanchez,1B,Pirates,,1975,459991,sanchga01,$-14.50,136,264,67,18,,7,,29,36,1,,44,1,4,7,,.254,.361,.402,.338,,,,,,,,,,,,,,,
Mike Carp,1B/DH/LF,Red Sox,,4297,455077,carpmi01,$-14.56,86,216,64,18,2,9,,34,43,1,,22,,2,3,,.296,.362,.523,.380,,,,,,,,,,,,,,,
John Mayberry,1B/CF/LF/RF,Phillies,,2368,460055,maybejo02,$-15.51,134,353,80,23,1,11,,47,39,5,3,27,1,3,1,,.227,.286,.391,.295,,,,,,,,,,,,,,,
Ike Davis,1B,Mets,Big Poison,2128,477195,davisik02,$-15.70,103,317,65,14,,9,,37,33,4,,57,5,1,2,,.205,.326,.334,.299,,,,,,,,,,,,,,,
Yuniesky Betancourt,1B/2B/3B,Brewers,,1401,435358,betanyu01,$-16.99,137,391,83,15,1,13,,35,46,,,14,3,1,3,,.212,.240,.355,.255,,,,,,,,,,,,,,,
Jeff Keppinger,1B/2B/3B/DH,White Sox,,2975,433898,keppije01,$-17.12,117,423,107,13,1,4,,38,40,,1,20,1,,5,2,.253,.282,.317,.266,,,,,,,,,,,,,,,
Ed Lucas,1B/2B/3B,Marlins,,1397,448296,lucased01,$-17.40,94,351,90,14,1,4,,43,28,1,1,26,1,2,1,4,.256,.307,.336,.289,,,,,,,,,,,,,,,
Darin Ruf,1B/LF/RF,Phillies,,5415,573131,rufda01,$-18.03,73,251,62,11,,14,,36,30,,,33,1,7,2,,.247,.348,.458,.351,,,,,,,,,,,,,,,
Lucas Duda,1B/LF/RF,Mets,,4970,446263,dudalu01,$-18.24,100,318,71,16,,15,,42,33,,3,55,4,9,2,,.223,.352,.415,.333,,,,,,,,,,,,,,,
Jeff Baker,1B/3B/LF/RF,Rangers,,2655,425557,bakerje03,$-18.73,74,154,43,8,,11,,21,21,1,,18,1,2,1,,.279,.360,.545,.386,,,,,,,,,,,,,,,
Ryan Flaherty,2B/OF,Orioles,,2676,475247,flahery01,$-19.70,85,246,55,11,,10,,28,27,2,,19,3,5,,1,.224,.292,.390,.298,,,,,,,,,,,,,,,
Jesus Guzman,1B/LF,Padres,,4114,461882,guzmaje01,$-20.66,126,288,65,17,,9,,33,35,3,,27,1,2,,1,.226,.296,.378,.300,,,,,,,,,,,,,,,
Kyle Blanks,1B/LF/RF,Padres,,4000,452035,blankky01,$-21.03,88,280,68,14,,8,,31,35,1,1,21,1,5,2,,.243,.305,.379,.300,,,,,,,,,,,,,,,
Nate Freiman,1B,Athletics,,3958,474384,freimna01,$-21.50,80,190,52,8,1,4,,10,24,,,14,,2,2,,.274,.327,.389,.317,,,,,,,,,,,,,,,
Logan Morrison,1B/LF,Marlins,,1974,489149,morrilo01,$-22.23,85,293,71,13,4,6,,32,36,,,38,5,2,,,.242,.333,.375,.312,,,,,,,,,,,,,,,
Kevin Frandsen,1B/2B/3B,Phillies,,119,435623,frandke01,$-22.33,119,252,59,10,1,5,,27,26,1,,12,,11,2,1,.234,.295,.341,.286,,,,,,,,,,,,,,,
Lance Berkman,1B/DH,Rangers,,2966,204020,berkmla01,$-22.41,73,256,62,10,1,6,,27,34,,,38,3,,,,.242,.340,.359,.313,,,,,,,,,,,,,,,
Josh Satin,1B/2B,Mets,,5249,543744,satinjo01,$-22.81,75,190,53,15,,3,,23,17,1,1,30,2,,1,,.279,.376,.405,.345,,,,,,,,,,,,,,,
Sean Rodríguez,1B/2B/3B/LF/SS,Rays,,631,446481,rodrise01,$-23.03,96,195,48,10,1,5,,21,23,1,3,17,,5,2,3,.246,.315,.385,.306,,,,,,,,,,,,,,,
Daric Barton,1B,Athletics,,4818,435558,bartoda02,$-23.06,37,104,28,2,,3,,15,16,,,13,,1,2,,.269,.350,.375,.325,,,,,,,,,,,,,,,
Carlos Pena,1B/DH,Royals,,569,150289,penaca01,$-23.46,89,280,58,13,1,8,,38,25,1,3,43,5,4,,1,.207,.320,.346,.293,,,,,,,,,,,,,,,
Chris Colabello,1B,Twins,,6327,499624,colabch01,$-24.61,55,160,31,3,,7,,14,17,,1,20,,1,,,.194,.287,.344,.281,,,,,,,,,,,,,,,
Sean Halton,1B,Brewers,,5228,488936,haltose01,$-24.62,42,101,24,4,,4,,9,17,,,5,,3,1,1,.238,.288,.396,.300,,,,,,,,,,,,,,,
Jason Giambi,1B/DH,Indians,,3794,114739,giambja01,$-25.82,71,186,34,8,,9,,21,31,,1,23,,4,3,,.183,.282,.371,.286,,,,,,,,,,,,,,,
Jordan Pacheco,1B/3B,Rockies,Las Vegas Giants,3788,457574,pachejo01,$-26.01,95,247,59,15,,1,,23,22,,,10,,3,1,1,.239,.275,.312,.263,,,,,,,,,,,,,,,
Chris Parmelee,1B/RF,Twins,,1530,476633,parmech01,$-26.17,101,294,67,13,,8,,21,24,1,1,33,,3,3,,.228,.309,.354,.296,,,,,,,,,,,,,,,
Greg Dobbs,1B/3B/LF,Marlins,,2331,425785,dobbsgr01,$-26.18,114,237,54,11,,2,,21,22,1,1,22,6,5,3,,.228,.303,.300,.265,,,,,,,,,,,,,,,
Donald Lutz,1B,Reds,,5557,544371,lutzdo01,$-27.32,34,58,14,1,,1,,5,8,2,,1,,,,,.241,.254,.310,.258,,,,,,,,,,,,,,,
Mark Teixeira,1B,Yankees,Dodger Blue,285,407893,teixema01,$-28.03,15,53,8,1,,3,,5,12,,,8,2,1,1,,.151,.270,.340,.258,,,,,,,,,,,,,,,
Brandon Snyder,1B,Red Sox,,441,474319,snydebr03,$-28.94,27,50,9,3,,2,,5,7,,,,,2,,,.180,.212,.360,.245,,,,,,,,,,,,,,,
Joe Mahoney,1B,Marlins,,5023,518977,mahonjo01,$-29.27,9,29,8,1,,1,,2,4,,,,,,,,.276,.276,.414,.298,,,,,,,,,,,,,,,
Steve Pearce,1B/DH/LF,Orioles,,3304,456665,pearcst01,$-29.40,44,119,31,7,,4,,14,13,1,,15,2,4,,,.261,.362,.420,.345,,,,,,,,,,,,,,,
Tyler Moore,1B/LF,Nationals,,2493,489138,moorety01,$-29.92,63,167,37,9,,4,,16,21,,,8,1,1,1,1,.222,.258,.347,.264,,,,,,,,,,,,,,,
Kevin Youkilis,1B/3B,Yankees,With the 5th Pick Truck Selects,115,425903,youklke01,$-30.33,28,105,23,7,,2,,12,8,,,8,1,5,,,.219,.305,.343,.288,,,,,,,,,,,,,,,
Eric Hinske,1B,Diamondbacks,,1873,400134,hinsker01,$-30.40,52,52,9,3,,1,,2,6,,,6,,,,,.173,.259,.288,.249,,,,,,,,,,,,,,,
Jordan Brown,1B,Marlins,,1095,488740,brownjo05,$-30.43,14,15,3,1,,,,,5,,,1,,,1,,.200,.235,.267,.221,,,,,,,,,,,,,,,
Efren Navarro,1B,Angels,,1673,519068,navaref01,$-30.43,4,4,1,,,,,,1,1,,2,,,,,.250,.500,.250,.425,,,,,,,,,,,,,,,
Brad Hawpe,1B,Angels,,3852,425547,hawpebr01,$-30.91,17,27,5,,,,,2,2,,,5,,,,,.185,.312,.185,.250,,,,,,,,,,,,,,,
José Abreu,1B,White Sox,,7346,547989,,$-31.12,,,,,,,,,,,,,,,,,,,,,,,,,,,,,,,,,,,
Mat Gamel,1B,Cubs,,3145,451143,gamelma01,$-31.12,,,,,,,,,,,,,,,,,,,,,,,,,,,,,,,,,,,
Jon Singleton,1B,Astros,,5593,572138,,$-31.12,,,,,,,,,,,,,,,,,,,,,,,,,,,,,,,,,,,
Dan Johnson,1B,Orioles,,4901,430681,johnsda06,$-31.51,3,5,,,,,,,,,,,,,,,,,,,,,,,,,,,,,,,,,
Chris Marrero,1B,Nationals,,2492,502029,marrech01,$-31.58,8,16,2,,,,,,1,,,,,,,,.125,.125,.125,.113,,,,,,,,,,,,,,,
Chris McGuiness,1B,Rangers,,111,573027,mcguich01,$-31.77,10,34,6,1,,,,,1,,,,,,,,.176,.176,.206,.169,,,,,,,,,,,,,,,
Travis Ishikawa,1B,White Sox,,4116,448170,ishiktr01,$-31.81,7,19,2,,,,,,1,,,1,,,,,.105,.150,.105,.125,,,,,,,,,,,,,,,
Alex Gonzalez,1B/SS,Brewers,,763,136460,gonzaal02,$-31.96,41,113,20,3,,1,,14,8,,,3,,1,1,,.177,.203,.230,.194,,,,,,,,,,,,,,,
Brock Peterson,1B,Cardinals,,1531,453857,peterbr02,$-32.18,23,26,2,,,,,,2,,,2,,,,,.077,.143,.077,.114,,,,,,,,,,,,,,,
Brett Pill,1B/LF,Giants,,4120,489209,pillbr01,$-32.22,48,85,19,4,,3,,11,12,,,5,,1,1,,.224,.272,.376,.283,,,,,,,,,,,,,,,
Casey Kotchman,1B,Marlins,,4301,425773,kotchca01,$-32.51,6,20,,,,,,,1,,,1,,,,,,.048,,.033,,,,,,,,,,,,,,,
Ty Wigginton,1B/3B,Cardinals,,458,421064,wiggity01,$-33.41,47,57,9,2,,,,9,3,,1,5,1,1,,,.158,.238,.193,.190,,,,,,,,,,,,,,,
Tyler Colvin,1B/CF/RF,Rockies,With the 5th Pick Truck Selects,2719,502125,colvity01,$-34.59,27,75,12,,,3,,8,10,,,3,1,,,,.160,.192,.280,.201,,,,,,,,,,,,,,,
Brent Lillibridge,1B/OF/SS,Yankees,,4957,452121,lillibr01,$-34.76,20,59,7,1,,,,2,5,1,,1,,,,1,.119,.131,.136,.127,,,,,,,,,,,,,,,
Alex Liddi,1B/3B,Orioles,,4314,499926,liddial01,$-35.15,8,17,1,1,,,,,,,,1,,,,,.059,.111,.118,.108,,,,,,,,,,,,,,,
Mark Kotsay,1B/OF,Padres,,894,117276,kotsama01,$-35.99,104,155,30,2,,1,,8,12,,2,13,,,2,1,.194,.251,.226,.217,,,,,,,,,,,,,,,
Corey Hart,1B/RF,Brewers,Big Poison,3192,430611,hartco01,$-36.96,,,,,,,,,,,,,,,,,,,,,,,,,,,,,,,,,,,
