Player,Position,ProTeam,RotoTeam,RVid,MLBAMID,BDBID,RotoValue,bG,bAB,bH,b2B,b3B,bHR,bRBOE,bR,bRBI,bSB,bCS,bBB,bIBB,bHBP,bSF,bSH,bAvg,bOBP,bSlg,bwOBA,pG,pIP,pBF,pH,pHR,pK,pPO,pFO,pGO,pLO,pSF,pSH,pBB,pIBB,pHB,pR,pER,pWin,pL,pSav,pStk,pFoul,piBall,pPit,pStk%,pWHIP,pERA,pR/9,pFIP,pkwERA
Victor Martínez,1B/DH,Tigers,Big Chee,101,400121,martivi01,$37.63,151,561,188,33,,32,,87,103,3,2,70,28,4,6,,.335,.409,.565,.404,,,,,,,,,,,,,,,,,,,,,,,,,,,,,,
José Abreu,1B/DH,White Sox,,7346,547989,,$36.39,145,556,176,35,2,36,,80,107,3,1,51,15,11,4,,.317,.383,.581,.403,,,,,,,,,,,,,,,,,,,,,,,,,,,,,,
Miguel Cabrera,1B/3B/DH,Tigers,RotoValue,1210,408234,cabremi01,$34.21,159,611,191,52,1,25,,101,109,1,1,60,10,3,11,,.313,.371,.524,.378,,,,,,,,,,,,,,,,,,,,,,,,,,,,,,
Anthony Rendon,2B/3B,Nationals,,5551,543685,rendoan01,$30.27,153,613,176,39,6,21,,111,83,17,3,58,2,5,5,2,.287,.350,.473,.361,,,,,,,,,,,,,,,,,,,,,,,,,,,,,,
Todd Frazier,1B/3B,Reds,Texas BigSticks,2863,453943,frazito01,$28.31,157,597,163,22,1,29,,88,80,20,8,52,2,7,4,,.273,.336,.459,.346,,,,,,,,,,,,,,,,,,,,,,,,,,,,,,
Buster Posey,1B/C,Giants,Las Vegas Giants,4108,457763,poseybu01,$28.20,147,547,170,28,2,22,,72,89,,1,47,5,3,8,,.311,.364,.490,.366,,,,,,,,,,,,,,,,,,,,,,,,,,,,,,
Albert Pujols,1B/DH,Angels,Dodger Blue,3503,405395,pujolal01,$27.46,159,633,172,37,1,28,,89,105,5,1,48,11,5,9,,.272,.324,.466,.335,,,,,,,,,,,,,,,,,,,,,,,,,,,,,,
Adrián González,1B,Dodgers,SportsWiseGuy.com,3959,408236,gonzaad01,$26.90,159,591,163,41,,27,,83,116,1,1,56,9,2,11,,.276,.335,.482,.345,,,,,,,,,,,,,,,,,,,,,,,,,,,,,,
Anthony Rizzo,1B,Cubs,The Seals Guys,113,519203,rizzoan01,$26.00,140,524,150,28,1,32,,89,78,5,4,73,7,15,4,,.286,.386,.527,.389,,,,,,,,,,,,,,,,,,,,,,,,,,,,,,
Josh Donaldson,3B,Athletics,The Seals Guys,4806,518626,donaljo02,$25.61,158,608,155,31,2,29,,93,98,8,,76,5,7,4,,.255,.342,.456,.348,,,,,,,,,,,,,,,,,,,,,,,,,,,,,,
Edwin Encarnación,1B/DH,Blue Jays,Moneyball,753,429665,encared01,$24.50,128,477,128,27,2,34,,75,98,2,,62,6,2,1,,.268,.354,.547,.382,,,,,,,,,,,,,,,,,,,,,,,,,,,,,,
Adrián Béltre,3B,Rangers,JetBlack,132,134181,beltrad01,$20.85,148,549,178,33,1,19,,79,77,1,1,57,13,3,5,,.324,.388,.492,.376,,,,,,,,,,,,,,,,,,,,,,,,,,,,,,
Kyle Seager,3B,Mariners,RotoValue,4318,572122,seageky01,$20.27,159,590,158,27,4,25,,71,96,7,5,52,3,8,3,1,.268,.333,.454,.340,,,,,,,,,,,,,,,,,,,,,,,,,,,,,,
Carlos Santana,1B/3B/C/DH,Indians,Dodger Blue,1047,467793,santaca01,$19.38,152,541,125,25,,27,,68,85,5,2,113,5,3,3,,.231,.365,.427,.349,,,,,,,,,,,,,,,,,,,,,,,,,,,,,,
Lucas Duda,1B/LF,Mets,,4970,446263,dudalu01,$19.15,153,514,130,27,,30,,74,92,3,2,69,8,9,4,,.253,.349,.481,.354,,,,,,,,,,,,,,,,,,,,,,,,,,,,,,
Freddie Freeman,1B,Braves,RotoValue,1836,518692,freemfr01,$19.12,162,607,175,43,4,18,,93,78,3,4,90,4,8,3,,.288,.386,.461,.369,,,,,,,,,,,,,,,,,,,,,,,,,,,,,,
Chris Carter,1B/DH/LF,Astros,Dodger Blue,4819,474892,cartech02,$18.27,145,507,115,21,1,37,,68,88,5,2,56,6,5,4,,.227,.308,.491,.337,,,,,,,,,,,,,,,,,,,,,,,,,,,,,,
Adam LaRoche,1B,Nationals,Dodger Blue,3650,425560,larocad01,$17.51,140,494,128,19,,26,,73,92,3,,82,9,2,8,,.259,.362,.455,.353,,,,,,,,,,,,,,,,,,,,,,,,,,,,,,
Evan Longoria,3B,Rays,With the 5th Pick Truck Selects,583,446334,longoev01,$16.87,162,624,158,26,1,22,,83,91,5,,57,11,9,9,1,.253,.320,.404,.314,,,,,,,,,,,,,,,,,,,,,,,,,,,,,,
Josh Harrison,2B/3B/LF/RF,Pirates,,3327,543281,harrijo05,$16.36,143,520,164,38,7,13,,77,52,18,7,22,1,4,2,2,.315,.345,.490,.363,,,,,,,,,,,,,,,,,,,,,,,,,,,,,,
Paul Goldschmidt,1B,Diamondbacks,With the 5th Pick Truck Selects,3648,502671,goldspa01,$16.00,109,406,122,39,1,19,,75,69,9,3,64,10,2,3,,.300,.396,.542,.398,,,,,,,,,,,,,,,,,,,,,,,,,,,,,,
Justin Morneau,1B,Rockies,RotoValue,1529,408047,morneju01,$15.31,135,502,160,32,3,17,,62,82,,3,34,4,6,8,,.319,.364,.496,.366,,,,,,,,,,,,,,,,,,,,,,,,,,,,,,
Brandon Moss,1B/DH/LF/RF,Athletics,JetBlack,3401,461235,mossbr01,$10.02,147,500,117,23,2,25,,70,81,1,,67,7,10,3,,.234,.334,.438,.334,,,,,,,,,,,,,,,,,,,,,,,,,,,,,,
Pablo Sandoval,3B,Giants,Old Hoss,4138,467055,sandopa01,$9.25,157,588,164,26,3,16,,68,73,,,39,6,4,7,,.279,.324,.415,.320,,,,,,,,,,,,,,,,,,,,,,,,,,,,,,
Matt Carpenter,2B/3B,Cardinals,Moneyball,5070,572761,carpema01,$8.83,158,595,162,33,2,8,,99,59,5,3,95,2,8,9,2,.272,.374,.375,.338,,,,,,,,,,,,,,,,,,,,,,,,,,,,,,
Ryan Howard,1B,Phillies,,2318,429667,howarry01,$8.21,153,569,127,18,1,23,,65,95,,,67,7,7,5,,.223,.310,.380,.302,,,,,,,,,,,,,,,,,,,,,,,,,,,,,,
Matt Adams,1B,Cardinals,,5355,571431,adamsma01,$7.15,142,527,152,34,5,15,,55,68,3,2,26,5,3,7,,.288,.321,.457,.332,,,,,,,,,,,,,,,,,,,,,,,,,,,,,,
Trevor Plouffe,3B,Twins,,1546,461858,plouftr01,$6.94,136,520,134,40,2,14,,69,80,2,1,53,2,4,5,,.258,.328,.423,.327,,,,,,,,,,,,,,,,,,,,,,,,,,,,,,
Nolan Arenado,3B,Rockies,,5217,571448,arenano01,$6.69,111,432,124,34,2,18,,58,61,2,1,25,1,4,5,1,.287,.328,.500,.353,,,,,,,,,,,,,,,,,,,,,,,,,,,,,,
James Loney,1B,Rays,JetBlack,4640,425766,loneyja01,$5.99,155,600,174,27,,9,,59,69,4,,41,2,4,6,,.290,.336,.380,.319,,,,,,,,,,,,,,,,,,,,,,,,,,,,,,
Steve Pearce,1B/DH/LF,Orioles,,3304,456665,pearcst01,$5.44,102,338,99,26,,21,,51,49,5,,40,1,4,1,,.293,.373,.556,.400,,,,,,,,,,,,,,,,,,,,,,,,,,,,,,
Aramis Ramirez,3B,Brewers,,2670,133380,ramirar01,$4.46,133,494,141,23,1,15,,47,66,3,,21,2,13,3,,.285,.330,.427,.331,,,,,,,,,,,,,,,,,,,,,,,,,,,,,,
Joe Mauer,1B/C/DH,Twins,SportsWiseGuy.com,1521,408045,mauerjo01,$4.25,120,455,126,27,2,4,,60,55,3,,60,12,1,2,,.277,.361,.371,.324,,,,,,,,,,,,,,,,,,,,,,,,,,,,,,
Lonnie Chisenhall,3B,Indians,,1070,502082,chiselo01,$4.12,142,478,134,29,1,13,,62,59,3,1,39,3,8,3,4,.280,.340,.427,.337,,,,,,,,,,,,,,,,,,,,,,,,,,,,,,
Martín Prado,2B/3B/LF,Yankees,Las Vegas Giants,1843,445988,pradoma01,$3.95,143,536,151,26,4,12,,62,58,3,1,26,,7,4,,.282,.321,.412,.322,,,,,,,,,,,,,,,,,,,,,,,,,,,,,,
Chris Davis,1B/3B,Orioles,Las Vegas Giants,4462,448801,davisch02,$3.74,127,450,88,16,,26,,65,72,2,1,60,9,9,5,1,.196,.299,.404,.302,,,,,,,,,,,,,,,,,,,,,,,,,,,,,,
Casey McGehee,3B,Marlins,,3148,431171,mcgehca01,$3.62,160,616,177,29,1,4,,56,76,4,2,67,3,1,7,,.287,.355,.357,.320,,,,,,,,,,,,,,,,,,,,,,,,,,,,,,
Michael Morse,1B/LF/RF,Giants,,2494,434604,morsemi01,$1.88,131,438,122,32,3,16,,48,61,,,31,,9,4,,.279,.336,.475,.350,,,,,,,,,,,,,,,,,,,,,,,,,,,,,,
David Wright,3B,Mets,SportsWiseGuy.com,2159,431151,wrighda03,$1.00,134,535,144,30,1,8,,54,63,8,5,42,5,4,5,,.269,.324,.374,.306,,,,,,,,,,,,,,,,,,,,,,,,,,,,,,
Luis Valbuena,2B/3B,Cubs,,1067,472528,valbulu01,$1.00,149,478,119,33,4,16,,68,51,1,2,65,4,2,1,1,.249,.340,.435,.337,,,,,,,,,,,,,,,,,,,,,,,,,,,,,,
Billy Butler,1B/DH,Royals,Moneyball,1375,456714,butlebi03,$1.00,151,549,149,32,,9,,57,66,,,41,3,5,8,,.271,.323,.379,.309,,,,,,,,,,,,,,,,,,,,,,,,,,,,,,
Mark Teixeira,1B,Yankees,,285,407893,teixema01,$1.00,123,440,95,14,,22,,56,62,1,1,58,3,6,4,,.216,.313,.398,.311,,,,,,,,,,,,,,,,,,,,,,,,,,,,,,
Adam Dunn,1B/DH,Athletics,Big Chee,2488,276055,dunnad01,$1.00,131,429,94,18,,22,,49,64,1,1,71,5,7,4,,.219,.337,.415,.328,,,,,,,,,,,,,,,,,,,,,,,,,,,,,,
Eric Hosmer,1B,Royals,SportsWiseGuy.com,5082,543333,hosmeer01,$1.00,131,503,136,35,1,9,,54,58,4,2,35,4,3,6,,.270,.318,.398,.311,,,,,,,,,,,,,,,,,,,,,,,,,,,,,,
Pedro Alvarez,3B,Pirates,With the 5th Pick Truck Selects,3320,476883,alvarpe01,$1.00,122,398,92,13,1,18,,46,56,8,3,45,6,2,,,.231,.312,.405,.312,,,,,,,,,,,,,,,,,,,,,,,,,,,,,,
Mike Napoli,1B,Red Sox,With the 5th Pick Truck Selects,1665,435063,napolmi01,$1.00,119,415,103,20,,17,,49,55,3,2,78,3,4,3,,.248,.370,.419,.349,,,,,,,,,,,,,,,,,,,,,,,,,,,,,,
Nick Castellanos,3B,Tigers,,5597,592206,casteni01,$1.00,148,533,138,31,4,11,,50,66,2,2,36,3,3,7,,.259,.306,.394,.303,,,,,,,,,,,,,,,,,,,,,,,,,,,,,,
Justin Turner,3B/SS,Dodgers,,446,457759,turneju01,$1.00,109,288,98,21,1,7,,46,43,6,1,28,1,4,2,,.340,.404,.493,.395,,,,,,,,,,,,,,,,,,,,,,,,,,,,,,
Yasmani Grandal,1B/C,Padres,,4985,518735,grandya01,$1.00,128,377,85,19,1,15,,47,49,3,,58,1,2,6,,.225,.327,.401,.322,,,,,,,,,,,,,,,,,,,,,,,,,,,,,,
Chris Johnson,3B,Braves,Big Poison,2983,453400,johnsch05,$-1.39,153,582,153,27,,10,,43,58,6,,23,2,2,2,2,.263,.291,.361,.290,,,,,,,,,,,,,,,,,,,,,,,,,,,,,,
Chase Headley,3B,Yankees,Big Chee,3979,452104,headlch01,$-1.56,135,470,114,20,1,13,,55,49,7,3,51,1,9,1,,.243,.328,.372,.313,,,,,,,,,,,,,,,,,,,,,,,,,,,,,,
Juan Uribe,3B,Dodgers,,4132,346874,uribeju01,$-1.64,103,386,120,23,,9,,36,54,,1,15,2,1,2,,.311,.337,.440,.336,,,,,,,,,,,,,,,,,,,,,,,,,,,,,,
Conor Gillaspie,3B,White Sox,,4135,543216,gillaco01,$-1.84,130,464,131,31,5,7,,50,57,,4,36,4,3,3,,.282,.336,.416,.324,,,,,,,,,,,,,,,,,,,,,,,,,,,,,,
David Freese,3B,Angels,,3514,501896,freesda01,$-2.43,134,462,120,25,1,10,,53,55,1,3,38,,6,5,,.260,.321,.383,.309,,,,,,,,,,,,,,,,,,,,,,,,,,,,,,
Garrett Jones,1B/RF,Marlins,,3397,434540,jonesga02,$-3.13,146,496,122,33,2,15,,59,53,,1,46,4,1,4,,.246,.309,.411,.311,,,,,,,,,,,,,,,,,,,,,,,,,,,,,,
Brock Holt,2B/3B/RF,Red Sox,,3344,571788,holtbr01,$-3.71,106,449,126,23,5,4,,68,29,12,2,33,,2,3,5,.281,.327,.381,.320,,,,,,,,,,,,,,,,,,,,,,,,,,,,,,
Xander Bogaerts,3B/SS,Red Sox,,6301,593428,bogaexa01,$-4.15,144,538,129,28,1,12,,60,46,2,3,39,1,8,7,2,.240,.296,.362,.289,,,,,,,,,,,,,,,,,,,,,,,,,,,,,,
Yangervis Solarte,2B/3B/SS,Padres,,1580,500208,,$-5.69,131,469,122,19,1,10,,56,48,,1,53,1,4,6,3,.260,.335,.369,.314,,,,,,,,,,,,,,,,,,,,,,,,,,,,,,
Matt Dominguez,3B,Astros,Las Vegas Giants,4933,518625,dominma01,$-6.20,157,564,121,17,,16,,51,57,,1,29,2,5,7,2,.215,.255,.330,.256,,,,,,,,,,,,,,,,,,,,,,,,,,,,,,
Mark Reynolds,1B/3B,Brewers,Big Poison,3664,448602,reynoma01,$-6.21,130,378,74,9,,22,,47,45,5,1,47,3,3,4,1,.196,.286,.394,.297,,,,,,,,,,,,,,,,,,,,,,,,,,,,,,
Stephen Vogt,1B/C,Athletics,,632,519390,vogtst01,$-6.29,84,269,75,10,2,9,,26,35,1,,16,2,1,1,,.279,.321,.431,.326,,,,,,,,,,,,,,,,,,,,,,,,,,,,,,
Mark Trumbo,1B/LF,Diamondbacks,With the 5th Pick Truck Selects,1675,444432,trumbma01,$-6.38,88,328,77,15,1,14,,37,61,2,3,28,3,1,5,,.235,.293,.415,.300,,,,,,,,,,,,,,,,,,,,,,,,,,,,,,
C.J. Cron,1B/C/DH,Angels,,6756,543068,,$-6.39,79,242,62,12,1,11,,28,37,,,10,,1,,,.256,.289,.450,.318,,,,,,,,,,,,,,,,,,,,,,,,,,,,,,
Eduardo Escobar,3B/SS,Twins,,917,500871,escobed01,$-6.73,133,433,119,35,2,6,,52,37,1,1,24,1,2,2,4,.275,.312,.406,.314,,,,,,,,,,,,,,,,,,,,,,,,,,,,,,
Manny Machado,3B,Orioles,SportsWiseGuy.com,5319,592518,machama01,$-6.97,82,327,91,14,,12,,38,32,2,,20,2,3,2,2,.278,.322,.431,.329,,,,,,,,,,,,,,,,,,,,,,,,,,,,,,
Adam Lind,1B/DH,Blue Jays,JetBlack,800,452252,lindad01,$-7.02,96,290,93,24,2,6,,38,40,,,28,3,,,,.321,.381,.479,.373,,,,,,,,,,,,,,,,,,,,,,,,,,,,,,
Mike Moustakas,3B,Royals,,1398,519058,moustmi01,$-7.31,140,457,97,21,1,15,,45,54,1,,35,1,3,4,1,.212,.270,.361,.277,,,,,,,,,,,,,,,,,,,,,,,,,,,,,,
Cody Asche,3B,Phillies,,6253,605125,ascheco01,$-7.50,121,397,100,25,,10,,43,46,,1,33,4,,1,3,.252,.306,.390,.303,,,,,,,,,,,,,,,,,,,,,,,,,,,,,,
Ike Davis,1B,Pirates,,2128,477195,davisik02,$-7.85,143,360,84,19,,11,,43,51,,4,63,3,,4,,.233,.344,.378,.317,,,,,,,,,,,,,,,,,,,,,,,,,,,,,,
Logan Morrison,1B/RF,Mariners,,1974,489149,morrilo01,$-8.32,99,336,88,20,,11,,41,38,5,2,24,1,3,2,,.262,.315,.420,.321,,,,,,,,,,,,,,,,,,,,,,,,,,,,,,
Juan Francisco,1B/3B,Blue Jays,,2835,464433,francju02,$-9.88,106,287,63,16,2,16,,40,43,,2,27,,3,3,,.220,.291,.456,.317,,,,,,,,,,,,,,,,,,,,,,,,,,,,,,
Mike Aviles,2B/3B/LF/SS,Indians,RotoValue,1400,449107,avilemi01,$-10.31,113,344,85,16,1,5,,38,39,14,5,13,,1,5,11,.247,.265,.343,.273,,,,,,,,,,,,,,,,,,,,,,,,,,,,,,
Scott Van Slyke,1B/CF/LF,Dodgers,,4716,475100,vanslsc01,$-10.43,98,212,63,13,1,11,,32,29,4,2,28,,4,2,,.297,.386,.524,.392,,,,,,,,,,,,,,,,,,,,,,,,,,,,,,
Alexi Amarista,2B/3B/CF/SS,Padres,,1677,506560,amarial01,$-11.76,148,423,101,13,2,5,,39,40,12,1,29,5,1,5,8,.239,.281,.314,.270,,,,,,,,,,,,,,,,,,,,,,,,,,,,,,
Brandon Belt,1B,Giants,The Seals Guys,4113,474832,beltbr01,$-12.10,61,214,52,8,,12,,30,27,3,1,18,2,2,1,,.243,.306,.449,.325,,,,,,,,,,,,,,,,,,,,,,,,,,,,,,
Kennys Vargas,1B/DH,Twins,,6989,573627,,$-12.16,53,215,59,10,1,9,,26,38,,,12,2,3,4,,.274,.316,.456,.329,,,,,,,,,,,,,,,,,,,,,,,,,,,,,,
Brayan Pena,1B/C,Reds,,1372,430910,penabr01,$-12.56,115,348,88,18,1,5,,23,26,2,3,20,2,,3,1,.253,.290,.353,.280,,,,,,,,,,,,,,,,,,,,,,,,,,,,,,
Jon Singleton,1B,Astros,,5593,572138,,$-12.85,95,310,52,13,,13,,42,44,2,3,50,1,1,1,,.168,.285,.335,.276,,,,,,,,,,,,,,,,,,,,,,,,,,,,,,
Brett Lawrie,2B/3B,Blue Jays,,3141,543434,lawribr01,$-13.15,70,259,64,9,,12,,27,38,,,16,,5,2,,.247,.301,.421,.314,,,,,,,,,,,,,,,,,,,,,,,,,,,,,,
J.P. Arencibia,1B/C,Rangers,,717,450317,arencjp01,$-13.35,62,203,36,9,,10,,20,35,,,10,,7,2,,.177,.239,.369,.263,,,,,,,,,,,,,,,,,,,,,,,,,,,,,,
Sean Rodríguez,1B/2B/DH/LF,Rays,,631,446481,rodrise01,$-13.91,96,237,50,13,3,12,,30,41,2,1,10,,6,3,3,.211,.255,.443,.297,,,,,,,,,,,,,,,,,,,,,,,,,,,,,,
Yonder Alonso,1B,Padres,,2819,475174,alonsyo01,$-14.91,84,267,64,19,1,7,,27,27,6,1,17,1,1,3,,.240,.285,.397,.298,,,,,,,,,,,,,,,,,,,,,,,,,,,,,,
Gaby Sanchez,1B,Pirates,,1975,459991,sanchga01,$-15.10,123,262,60,18,1,7,,31,33,2,,23,,2,3,,.229,.293,.385,.299,,,,,,,,,,,,,,,,,,,,,,,,,,,,,,
Allen Craig,1B/LF/RF,Red Sox,Texas BigSticks,3529,501800,craigal01,$-15.24,126,461,99,20,1,8,,41,46,2,1,35,,7,2,,.215,.279,.315,.267,,,,,,,,,,,,,,,,,,,,,,,,,,,,,,
Tommy Medica,1B/LF,Padres,,6843,523265,medicto01,$-15.33,102,240,56,11,2,9,,31,27,6,1,14,,4,1,,.233,.286,.408,.306,,,,,,,,,,,,,,,,,,,,,,,,,,,,,,
Eduardo Núñez,3B/SS,Twins,,314,456488,nunezed02,$-15.38,72,204,51,7,4,4,,26,24,9,3,5,,1,,3,.250,.268,.382,.288,,,,,,,,,,,,,,,,,,,,,,,,,,,,,,
Ryan Zimmerman,3B/LF,Nationals,Old Hoss,2519,475582,zimmery01,$-15.67,61,214,60,19,1,5,,26,38,,,22,,,4,,.280,.342,.449,.343,,,,,,,,,,,,,,,,,,,,,,,,,,,,,,
Wilmer Flores,3B/SS,Mets,,2165,527038,florewi01,$-15.72,78,259,65,13,1,6,,28,29,1,,12,2,1,1,1,.251,.285,.378,.289,,,,,,,,,,,,,,,,,,,,,,,,,,,,,,
Joey Votto,1B,Reds,Texas BigSticks,2825,458015,vottojo01,$-15.97,62,220,56,16,,6,,32,23,1,1,47,2,3,2,,.255,.390,.409,.355,,,,,,,,,,,,,,,,,,,,,,,,,,,,,,
Kendrys Morales,1B/DH,Mariners,Old Hoss,1672,434778,moralke01,$-16.40,98,367,80,20,,8,,28,42,,,27,3,3,4,,.218,.274,.338,.268,,,,,,,,,,,,,,,,,,,,,,,,,,,,,,
Lyle Overbay,1B,Brewers,,738,407489,overbly01,$-17.54,121,258,60,14,,4,,24,35,2,,36,2,1,1,,.233,.328,.333,.300,,,,,,,,,,,,,,,,,,,,,,,,,,,,,,
Chris Colabello,1B,Twins,,6327,499624,colabch01,$-17.57,59,205,47,13,,6,,17,39,,2,14,1,1,,,.229,.282,.380,.284,,,,,,,,,,,,,,,,,,,,,,,,,,,,,,
Chris Parmelee,1B/LF/RF,Twins,,1530,476633,parmech01,$-17.72,87,250,64,11,,7,,27,28,,3,17,,2,1,,.256,.307,.384,.300,,,,,,,,,,,,,,,,,,,,,,,,,,,,,,
Nick Swisher,1B/DH/RF,Indians,Big Chee,346,430897,swishni01,$-17.86,97,360,75,20,,8,,33,42,,,36,,,4,1,.208,.277,.331,.271,,,,,,,,,,,,,,,,,,,,,,,,,,,,,,
Marcus Semien,2B/3B/SS,White Sox,,5897,543760,semiema01,$-18.04,64,231,54,10,2,6,,30,28,3,,21,,1,,2,.234,.298,.372,.301,,,,,,,,,,,,,,,,,,,,,,,,,,,,,,
Ryan Flaherty,2B/3B/SS,Orioles,,2676,475247,flahery01,$-18.09,102,281,62,15,1,7,,33,32,1,,22,2,5,1,3,.221,.285,.356,.284,,,,,,,,,,,,,,,,,,,,,,,,,,,,,,
Mike Olt,3B,Cubs,,5244,592609,oltmi01,$-18.42,89,225,36,8,,12,,23,33,,1,25,,3,5,,.160,.248,.356,.262,,,,,,,,,,,,,,,,,,,,,,,,,,,,,,
Andrew Romine,3B/SS,Tigers,,1699,461865,rominan01,$-18.67,94,251,57,6,,2,,30,12,12,2,18,,,,4,.227,.275,.275,.261,,,,,,,,,,,,,,,,,,,,,,,,,,,,,,
Justin Smoak,1B,Blue Jays,,4469,475253,smoakju01,$-18.77,80,248,50,13,,7,,28,30,,1,24,,2,2,,.202,.275,.339,.272,,,,,,,,,,,,,,,,,,,,,,,,,,,,,,
Alberto Callaspo,1B/2B/3B/DH,Athletics,,1392,430948,callaal01,$-18.91,127,404,90,15,,4,,37,39,,1,40,1,1,6,,.223,.290,.290,.263,,,,,,,,,,,,,,,,,,,,,,,,,,,,,,
Jeff Baker,1B/2B/3B/LF,Marlins,,2655,425557,bakerje03,$-19.19,90,208,55,10,4,3,,27,28,1,,13,1,1,3,,.264,.307,.394,.306,,,,,,,,,,,,,,,,,,,,,,,,,,,,,,
Kristopher Negrón,3B/CF,Reds,,2846,502117,negrokr01,$-19.72,49,144,39,10,1,6,,19,17,5,,12,,1,,1,.271,.329,.479,.358,,,,,,,,,,,,,,,,,,,,,,,,,,,,,,
Logan Forsythe,2B/3B/DH,Rays,,3977,523253,forsylo01,$-19.72,110,301,67,12,1,6,,32,26,2,,25,,4,4,2,.223,.286,.329,.277,,,,,,,,,,,,,,,,,,,,,,,,,,,,,,
Kelly Johnson,1B/2B/3B/LF,Orioles,,3653,430637,johnske05,$-19.77,106,265,57,14,2,7,,29,27,2,2,29,,2,1,,.215,.296,.362,.291,,,,,,,,,,,,,,,,,,,,,,,,,,,,,,
Danny Valencia,1B/3B/DH,Blue Jays,,1549,502143,valenda01,$-19.96,86,264,68,16,1,4,,20,30,1,1,14,,2,4,,.258,.296,.371,.292,,,,,,,,,,,,,,,,,,,,,,,,,,,,,,
Jordan Pacheco,1B/C,Diamondbacks,,3788,457574,pachejo01,$-20.50,69,153,39,10,1,,,10,16,,,9,,1,1,1,.255,.297,.333,.282,,,,,,,,,,,,,,,,,,,,,,,,,,,,,,
Adam Rosales,1B/2B/SS,Rangers,,4847,489267,rosalad01,$-20.93,56,164,43,7,,4,,20,19,4,2,13,,3,,,.262,.328,.378,.315,,,,,,,,,,,,,,,,,,,,,,,,,,,,,,
Mitch Moreland,1B/DH,Rangers,Old Hoss,4519,519048,morelmi01,$-22.30,52,167,41,9,1,2,,18,23,,,12,,1,2,2,.246,.293,.347,.286,,,,,,,,,,,,,,,,,,,,,,,,,,,,,,
Steve Tolleson,2B/3B,Blue Jays,,4833,476270,tollest01,$-22.30,108,170,43,7,2,3,,21,16,3,1,12,,2,1,4,.253,.302,.371,.302,,,,,,,,,,,,,,,,,,,,,,,,,,,,,,
Prince Fielder,1B,Rangers,Las Vegas Giants,3131,425902,fieldpr01,$-22.33,42,150,37,8,,3,,19,16,,,25,11,2,1,,.247,.360,.360,.303,,,,,,,,,,,,,,,,,,,,,,,,,,,,,,
John Mayberry,1B/CF/LF/RF,Blue Jays,,2368,460055,maybejo02,$-22.88,78,146,31,10,,7,,15,23,,,20,,1,1,,.212,.310,.425,.320,,,,,,,,,,,,,,,,,,,,,,,,,,,,,,
Ryan Rua,3B,Rangers,,10470,607387,,$-22.91,28,105,31,7,,2,,11,14,1,,2,,2,,,.295,.321,.419,.327,,,,,,,,,,,,,,,,,,,,,,,,,,,,,,
Eric Campbell,3B/LF,Mets,,2153,493472,,$-23.14,85,190,50,9,,3,,16,16,3,,17,,1,3,,.263,.322,.358,.307,,,,,,,,,,,,,,,,,,,,,,,,,,,,,,
Brandon Hicks,2B/3B,Giants,,1857,518794,hicksbr01,$-23.25,71,204,33,6,1,8,,27,22,,1,32,3,2,1,3,.162,.277,.319,.265,,,,,,,,,,,,,,,,,,,,,,,,,,,,,,
Nate Freiman,1B,Athletics,,3958,474384,freimna01,$-23.31,36,87,19,5,,5,,12,15,,,5,1,1,,,.218,.269,.448,.303,,,,,,,,,,,,,,,,,,,,,,,,,,,,,,
Jake Lamb,3B,Diamondbacks,,6457,571875,,$-23.58,37,126,29,4,1,4,,15,11,1,1,6,,,1,,.230,.263,.373,.275,,,,,,,,,,,,,,,,,,,,,,,,,,,,,,
Travis Ishikawa,1B,Giants,,4116,448170,ishiktr01,$-23.66,62,107,27,4,1,3,,9,18,,,9,1,1,2,,.252,.311,.393,.305,,,,,,,,,,,,,,,,,,,,,,,,,,,,,,
Paul Konerko,1B/DH,White Sox,,893,117244,konerpa01,$-23.69,81,208,43,8,,5,,15,22,,,10,,4,2,,.207,.254,.317,.254,,,,,,,,,,,,,,,,,,,,,,,,,,,,,,
Ben Paulsen,1B,Rockies,,5146,572019,,$-23.71,31,63,20,4,,4,,8,10,,,2,1,1,,,.317,.348,.571,.388,,,,,,,,,,,,,,,,,,,,,,,,,,,,,,
Ramon Santiago,2B/3B/SS,Reds,,1246,421124,santira01,$-23.96,75,179,44,8,,2,,20,17,2,1,24,,3,1,7,.246,.332,.324,.307,,,,,,,,,,,,,,,,,,,,,,,,,,,,,,
Jake Smolinski,3B/OF,Rangers,,5477,519295,,$-24.02,24,86,30,5,,3,,12,12,,,3,,3,,,.349,.391,.512,.394,,,,,,,,,,,,,,,,,,,,,,,,,,,,,,
Don Kelly,1B/3B/CF/LF/RF,Tigers,,1254,430603,kellydo01,$-24.82,95,163,40,5,1,,,24,7,6,1,20,1,1,,1,.245,.330,.288,.292,,,,,,,,,,,,,,,,,,,,,,,,,,,,,,
Marc Krauss,1B/DH/OF,Astros,,3690,571868,krausma01,$-25.07,67,186,36,6,,6,,16,21,,,21,,1,,,.194,.279,.323,.272,,,,,,,,,,,,,,,,,,,,,,,,,,,,,,
Kevin Frandsen,1B/2B/3B/LF,Nationals,,119,435623,frandke01,$-25.14,105,220,57,8,,1,,17,17,,,6,,7,1,2,.259,.297,.309,.275,,,,,,,,,,,,,,,,,,,,,,,,,,,,,,
Justin Bour,1B,Marlins,,2645,571506,,$-25.33,39,74,21,3,,1,,10,11,,,9,1,,,,.284,.361,.365,.325,,,,,,,,,,,,,,,,,,,,,,,,,,,,,,
Eric Chavez,3B,Diamondbacks,,4871,136767,chaveer01,$-25.48,44,69,17,3,1,3,,6,8,2,,11,,,1,,.246,.346,.449,.352,,,,,,,,,,,,,,,,,,,,,,,,,,,,,,
Charlie Culberson,2B/3B/LF/SS,Rockies,,5064,518586,culbech01,$-25.59,95,210,41,7,2,3,,17,24,2,2,12,2,5,2,4,.195,.249,.290,.238,,,,,,,,,,,,,,,,,,,,,,,,,,,,,,
Joaquin Arias,2B/3B/SS,Giants,,4471,435078,ariasjo01,$-25.86,107,193,49,9,,,,18,15,1,,8,2,,2,1,.254,.279,.301,.257,,,,,,,,,,,,,,,,,,,,,,,,,,,,,,
Enrique Hernández,1B/OF,Marlins,,5301,571771,,$-25.87,42,121,30,6,3,3,,13,14,,,12,,1,,,.248,.321,.421,.325,,,,,,,,,,,,,,,,,,,,,,,,,,,,,,
Ryan Wheeler,3B,Angels,,3651,572253,wheelry01,$-25.97,31,56,13,2,,2,,6,13,,,5,,,3,,.232,.281,.375,.283,,,,,,,,,,,,,,,,,,,,,,,,,,,,,,
Efren Navarro,1B/LF,Angels,,1673,519068,navaref01,$-26.05,64,159,39,10,1,1,,17,14,1,3,13,2,,,2,.245,.299,.340,.276,,,,,,,,,,,,,,,,,,,,,,,,,,,,,,
Nick Punto,2B/3B/SS,Athletics,,1547,346857,puntoni01,$-26.14,73,198,41,7,2,2,,21,14,3,1,25,,,,1,.207,.295,.293,.272,,,,,,,,,,,,,,,,,,,,,,,,,,,,,,
Will Middlebrooks,3B,Red Sox,,5215,519025,middlwi01,$-26.27,63,215,41,10,,2,,14,19,1,1,15,1,4,,,.191,.256,.265,.236,,,,,,,,,,,,,,,,,,,,,,,,,,,,,,
Ed Lucas,1B/2B/3B,Rangers,,1397,448296,lucased01,$-26.39,69,179,45,5,,1,,19,9,1,,8,,,,2,.251,.280,.296,.263,,,,,,,,,,,,,,,,,,,,,,,,,,,,,,
Kevin Kouzmanoff,1B/3B,Rangers,,4837,450260,kouzmke01,$-26.62,13,47,17,6,,2,,8,10,,,2,1,2,,,.362,.412,.617,.434,,,,,,,,,,,,,,,,,,,,,,,,,,,,,,
Tyler Moore,1B/LF,Nationals,,2493,489138,moorety01,$-26.66,42,91,21,2,,4,,8,14,,,7,,2,,,.231,.300,.385,.303,,,,,,,,,,,,,,,,,,,,,,,,,,,,,,
Donnie Murphy,2B/3B,Braves,,1998,430906,murphdo01,$-26.89,45,112,22,3,,4,,11,14,,1,11,,1,3,1,.196,.266,.330,.261,,,,,,,,,,,,,,,,,,,,,,,,,,,,,,
Daniel Descalso,2B/3B/SS,Cardinals,,3506,518614,descada01,$-26.95,104,161,39,11,,,,20,10,1,3,20,,2,,1,.242,.332,.311,.290,,,,,,,,,,,,,,,,,,,,,,,,,,,,,,
Ramiro Pena,2B/3B,Braves,,315,455369,penara02,$-27.10,81,147,36,6,,3,,9,9,1,,13,3,,1,4,.245,.297,.347,.285,,,,,,,,,,,,,,,,,,,,,,,,,,,,,,
Grant Green,2B/3B,Angels,,4844,502205,greengr01,$-27.36,43,99,27,5,,1,,7,11,1,4,2,,,2,,.273,.282,.354,.260,,,,,,,,,,,,,,,,,,,,,,,,,,,,,,
Darin Ruf,1B/LF/RF,Phillies,,5415,573131,rufda01,$-27.37,52,102,24,8,,3,,13,8,,,8,,4,2,1,.235,.308,.402,.311,,,,,,,,,,,,,,,,,,,,,,,,,,,,,,
Kyle Blanks,1B/LF/RF,Athletics,,4000,452035,blankky01,$-27.37,26,55,17,1,,2,,10,7,,,8,,2,1,,.309,.409,.436,.377,,,,,,,,,,,,,,,,,,,,,,,,,,,,,,
Matt McBride,1B,Rockies,,1099,473724,mcbrima02,$-27.37,21,31,7,2,,2,,6,6,,,2,,1,,,.226,.294,.484,.332,,,,,,,,,,,,,,,,,,,,,,,,,,,,,,
Freddy Galvis,2B/3B/SS,Phillies,,2342,520471,galvifr01,$-27.46,43,119,21,3,1,4,,14,12,1,,8,,,1,,.176,.227,.319,.241,,,,,,,,,,,,,,,,,,,,,,,,,,,,,,
Josh Wilson,3B,Rangers,,4329,425543,wilsojo03,$-27.49,24,67,16,4,,,,7,8,1,,2,,1,,2,.239,.264,.299,.259,,,,,,,,,,,,,,,,,,,,,,,,,,,,,,
Ian Stewart,3B,Angels,,3819,456655,stewaia01,$-27.51,24,68,12,2,3,2,,8,7,1,,3,,1,,,.176,.222,.382,.262,,,,,,,,,,,,,,,,,,,,,,,,,,,,,,
Reid Brignac,3B/SS,Phillies,,588,458582,brignre01,$-27.55,37,81,18,5,1,1,,4,10,1,1,9,1,,,1,.222,.297,.346,.282,,,,,,,,,,,,,,,,,,,,,,,,,,,,,,
Dan Johnson,1B,Blue Jays,,4901,430681,johnsda06,$-27.56,15,38,8,2,,1,,8,7,,,7,,1,2,,.211,.333,.342,.304,,,,,,,,,,,,,,,,,,,,,,,,,,,,,,
Nick Evans,1B,Diamondbacks,,2188,452783,evansni01,$-27.62,18,22,6,2,,2,,2,7,,,1,,,,,.273,.304,.636,.391,,,,,,,,,,,,,,,,,,,,,,,,,,,,,,
Chone Figgins,3B,Dodgers,,4307,408210,figgich01,$-27.94,38,60,13,3,,,,8,1,4,1,14,,1,,1,.217,.368,.267,.317,,,,,,,,,,,,,,,,,,,,,,,,,,,,,,
Garin Cecchini,3B,Red Sox,,6920,594555,,$-27.95,11,31,8,3,,1,,6,4,,,3,,2,,,.258,.361,.452,.357,,,,,,,,,,,,,,,,,,,,,,,,,,,,,,
Jake Goebbert,1B/LF,Padres,,5303,572876,,$-28.08,51,101,22,1,3,1,,12,10,2,1,12,3,2,,,.218,.313,.317,.277,,,,,,,,,,,,,,,,,,,,,,,,,,,,,,
Zelous Wheeler,3B,Yankees,,3149,519412,,$-28.17,29,57,11,,,2,,6,5,,,2,,1,1,1,.193,.226,.298,.233,,,,,,,,,,,,,,,,,,,,,,,,,,,,,,
Chris Nelson,3B,Padres,,3823,455126,nelsoch01,$-28.24,27,73,17,3,,,,5,7,1,2,7,1,,1,,.233,.296,.274,.247,,,,,,,,,,,,,,,,,,,,,,,,,,,,,,
Cole Figueroa,3B,Rays,,4886,502676,,$-28.41,23,43,10,2,1,,,6,6,,,4,,,2,,.233,.286,.326,.269,,,,,,,,,,,,,,,,,,,,,,,,,,,,,,
Carlos Rivero,3B,Red Sox,,1083,491640,,$-28.56,4,7,4,2,,1,,1,3,,,1,,,,,.571,.625,1.286,.763,,,,,,,,,,,,,,,,,,,,,,,,,,,,,,
Xavier Nady,1B,Mariners,,2724,294558,nadyxa01,$-28.56,22,37,5,1,,3,,4,4,,,5,,,,,.135,.238,.405,.277,,,,,,,,,,,,,,,,,,,,,,,,,,,,,,
Andy Marte,3B,Diamondbacks,,1058,429708,martean01,$-29.46,6,16,3,,,1,,1,3,,,,,,,,.188,.188,.375,.237,,,,,,,,,,,,,,,,,,,,,,,,,,,,,,
Clint Robinson,1B,Dodgers,,1442,519208,robincl01,$-29.46,9,9,3,,,,,3,2,,,1,,,,,.333,.400,.333,.340,,,,,,,,,,,,,,,,,,,,,,,,,,,,,,
Adam Duvall,1B/3B,Giants,,6383,594807,,$-29.67,28,73,14,2,,3,,8,5,,,3,,1,,,.192,.234,.342,.252,,,,,,,,,,,,,,,,,,,,,,,,,,,,,,
Maikel Franco,3B,Phillies,,7402,596748,,$-29.72,16,56,10,2,,,,5,5,,,1,,,1,,.179,.190,.214,.179,,,,,,,,,,,,,,,,,,,,,,,,,,,,,,