Player,Position,ProTeam,RotoTeam,RVid,MLBAMID,BDBID,RotoValue,bG,bAB,bH,b2B,b3B,bHR,bRBOE,bR,bRBI,bSB,bCS,bBB,bIBB,bHBP,bSF,bSH,bAvg,bOBP,bSlg,bwOBA,pG,pIP,pH,pHR,pK,pBB,pIBB,pHB,pER,pWin,pL,pSav,pWHIP,pERA,pFIP
Cody Bellinger,1B/CF/RF,Dodgers,,10872,641355,,$41.87,156,558,170,34,3,47,4,121,115,15,5,95,21,3,4,,.305,.406,.629,.434,,,,,,,,,,,,,,,
Alex Bregman,3B/SS,Astros,,11366,608324,,$32.23,156,554,164,37,2,41,2,122,112,5,1,119,2,9,8,,.296,.423,.592,.433,,,,,,,,,,,,,,,
Trevor Story,SS,Rockies,,6508,596115,,$31.92,145,588,173,38,5,35,6,111,85,23,8,58,,7,3,,.294,.363,.554,.402,,,,,,,,,,,,,,,
Freddie Freeman,1B,Braves,,1836,518692,freemfr01,$31.86,158,597,176,34,2,38,2,113,121,6,3,87,11,6,2,,.295,.389,.549,.400,,,,,,,,,,,,,,,
Jonathan Villar,2B/SS,Orioles,,5185,542340,villajo01,$31.11,162,642,176,33,5,24,5,111,73,40,9,61,,4,4,2,.274,.338,.453,.359,,,,,,,,,,,,,,,
Xander Bogaerts,SS,Red Sox,,6301,593428,bogaexa01,$30.64,155,614,190,52,,33,7,110,117,4,2,76,2,2,6,,.309,.384,.555,.409,,,,,,,,,,,,,,,
Ketel Marte,2B/CF/SS,Diamondbacks,,6003,606466,,$30.48,144,569,187,36,9,32,3,97,92,10,2,53,2,4,2,,.329,.389,.592,.423,,,,,,,,,,,,,,,
DJ LeMahieu,1B/2B/3B,Yankees,,2658,518934,lemahdj01,$29.75,145,602,197,33,2,26,6,109,102,5,2,46,,2,4,1,.327,.374,.518,.395,,,,,,,,,,,,,,,
Pete Alonso,1B,Mets,,12005,624413,,$27.04,161,597,155,30,2,53,8,103,120,1,,72,6,21,3,,.260,.358,.583,.405,,,,,,,,,,,,,,,
Marcus Semien,SS,Athletics,,5897,543760,semiema01,$26.66,162,657,187,43,7,33,12,123,92,10,8,87,2,2,1,,.285,.369,.522,.396,,,,,,,,,,,,,,,
Francisco Lindor,SS,Indians,,6421,596019,,$24.56,143,598,170,40,2,32,3,101,74,22,5,46,9,3,6,1,.284,.335,.518,.368,,,,,,,,,,,,,,,
Trea Turner,SS,Nationals,,10635,607208,,$23.01,122,521,155,37,5,19,3,96,57,35,5,43,2,3,2,,.298,.353,.497,.382,,,,,,,,,,,,,,,
Eduardo Escobar,2B/3B/SS,Diamondbacks,,917,500871,escobed01,$22.54,158,636,171,29,10,35,6,94,118,5,1,50,3,3,10,,.269,.320,.511,.360,,,,,,,,,,,,,,,
Trey Mancini,1B/LF/RF,Orioles,,9387,641820,,$21.72,154,602,175,38,2,35,5,106,97,1,,63,3,9,5,,.291,.364,.535,.390,,,,,,,,,,,,,,,
José Abreu,1B/DH,White Sox,,7346,547989,,$21.47,159,634,180,38,1,33,7,85,123,2,2,36,4,13,10,,.284,.330,.503,.362,,,,,,,,,,,,,,,
Yuli Gurriel,1B/3B,Astros,,11531,493329,,$20.58,144,564,168,40,2,31,4,85,104,5,3,37,2,5,6,,.298,.343,.541,.380,,,,,,,,,,,,,,,
Carlos Santana,1B/DH,Indians,,1047,467793,santaca01,$20.56,158,573,161,30,1,34,4,110,93,4,,108,12,3,2,,.281,.397,.515,.397,,,,,,,,,,,,,,,
Gleyber Torres,2B/SS,Yankees,,10684,650402,,$20.40,144,546,152,26,,38,2,96,90,5,2,48,3,3,6,1,.278,.336,.535,.372,,,,,,,,,,,,,,,
Josh Bell,1B,Pirates,,6324,605137,,$20.26,143,527,146,37,3,37,2,94,116,,1,74,13,5,7,,.277,.367,.569,.391,,,,,,,,,,,,,,,
Danny Santana,1B/CF,Rangers,,5347,542454,,$18.77,130,474,134,23,6,28,2,81,81,21,6,25,2,6,5,,.283,.324,.534,.370,,,,,,,,,,,,,,,
Javier Báez,2B/3B/SS,Cubs,,6040,595879,,$17.66,138,531,149,38,4,29,3,89,85,11,7,28,3,,2,,.281,.316,.531,.361,,,,,,,,,,,,,,,
Tim Anderson,SS,White Sox,,10574,641313,,$16.75,123,498,167,32,,18,3,81,56,17,5,15,,3,2,,.335,.357,.508,.383,,,,,,,,,,,,,,,
Anthony Rizzo,1B,Cubs,,113,519203,rizzoan01,$16.14,146,512,150,29,3,27,1,89,94,5,2,71,3,27,3,,.293,.405,.520,.401,,,,,,,,,,,,,,,
Max Muncy,1B/2B/3B,Dodgers,,9385,571970,,$15.97,141,487,122,22,1,35,7,101,98,4,1,90,1,8,4,,.251,.374,.515,.394,,,,,,,,,,,,,,,
Jorge Polanco,SS,Twins,,6049,593871,,$15.64,153,631,186,40,7,22,9,107,79,4,3,60,2,4,7,2,.295,.355,.485,.374,,,,,,,,,,,,,,,
Yasmani Grandal,1B/C,Brewers,,4985,518735,grandya01,$15.49,153,513,126,26,2,28,2,79,77,5,1,109,2,5,5,,.246,.380,.468,.374,,,,,,,,,,,,,,,
Elvis Andrus,SS,Rangers,,4483,462101,andruel01,$14.77,147,600,165,27,4,12,11,81,72,31,8,34,1,4,10,,.275,.313,.393,.330,,,,,,,,,,,,,,,
Paul Goldschmidt,1B,Cardinals,,3648,502671,goldspa01,$14.55,161,597,155,25,1,34,6,97,97,3,1,78,2,2,3,,.260,.346,.476,.364,,,,,,,,,,,,,,,
Amed Rosario,SS,Mets,,10972,642708,,$11.66,157,616,177,30,7,15,7,75,72,19,10,31,2,3,3,2,.287,.322,.432,.337,,,,,,,,,,,,,,,
Adalberto Mondesi,SS,Royals,,7458,609275,,$10.84,102,415,109,20,10,9,4,58,62,43,7,19,,,6,3,.263,.289,.424,.332,,,,,,,,,,,,,,,
Matt Olson,1B,Athletics,,9384,621566,,$9.77,127,483,129,26,,36,3,73,91,,,51,7,12,1,,.267,.351,.545,.383,,,,,,,,,,,,,,,
Manny Machado,3B/SS,Padres,,5319,592518,machama01,$8.95,156,587,150,21,2,32,3,81,85,5,3,65,3,6,3,,.256,.334,.462,.348,,,,,,,,,,,,,,,
Christian Walker,1B,Diamondbacks,,6465,572233,,$8.42,152,529,137,26,1,29,2,86,73,8,1,67,6,6,1,,.259,.348,.476,.360,,,,,,,,,,,,,,,
Kevin Newman,2B/SS,Pirates,,12289,621028,,$8.38,130,493,152,20,6,12,9,61,64,16,8,28,2,7,1,2,.308,.352,.446,.365,,,,,,,,,,,,,,,
Hunter Dozier,1B/3B/RF,Royals,,10142,641531,,$7.73,139,523,146,29,10,26,3,75,84,2,2,55,2,3,5,,.279,.348,.522,.374,,,,,,,,,,,,,,,
Fernando Tatis Jr.,SS,Padres,,11972,665487,,$7.72,84,334,106,13,6,22,5,61,53,16,6,30,1,5,3,,.317,.379,.590,.425,,,,,,,,,,,,,,,
Paul DeJong,SS,Cardinals,,11418,657557,,$7.24,159,583,136,31,1,30,7,97,78,9,5,62,1,13,6,,.233,.318,.444,.339,,,,,,,,,,,,,,,
Joc Pederson,1B/CF/LF/RF,Dodgers,,5344,592626,,$6.03,149,450,112,16,3,36,2,83,74,1,1,50,2,12,2,,.249,.339,.538,.374,,,,,,,,,,,,,,,
Edwin Encarnación,1B/DH,Yankees,,753,429665,encared01,$5.91,109,418,102,18,,34,5,81,86,,1,58,1,7,3,,.244,.344,.531,.380,,,,,,,,,,,,,,,
Eric Hosmer,1B,Padres,,5082,543333,hosmeer01,$5.05,160,619,164,29,2,22,3,72,99,,3,40,3,3,5,,.265,.310,.425,.320,,,,,,,,,,,,,,,
Corey Seager,SS,Dodgers,,6429,608369,,$4.51,134,489,133,44,1,19,1,82,87,1,,44,3,4,4,,.272,.335,.483,.352,,,,,,,,,,,,,,,
Howie Kendrick,1B/2B/LF,Nationals,,1679,435062,kendrho01,$4.40,121,334,115,23,1,17,4,61,62,2,1,27,1,4,5,,.344,.395,.572,.422,,,,,,,,,,,,,,,
Renato Núñez,1B/3B/DH,Orioles,,9535,600524,,$3.83,151,541,132,24,,31,3,72,90,1,1,44,1,10,4,,.244,.311,.460,.336,,,,,,,,,,,,,,,
Ryan McMahon,1B/2B/3B,Rockies,,10706,641857,,$3.59,141,480,120,22,1,24,3,70,83,5,1,56,1,1,1,1,.250,.328,.450,.345,,,,,,,,,,,,,,,
Nick Ahmed,SS,Diamondbacks,,5892,605113,,$3.56,158,556,141,33,6,19,9,79,82,8,2,52,2,4,12,1,.254,.315,.437,.338,,,,,,,,,,,,,,,
Asdrúbal Cabrera,2B/3B/SS,Nationals,,1079,452678,cabreas01,$3.24,131,447,116,25,1,18,5,69,91,4,,57,2,3,7,,.260,.342,.441,.351,,,,,,,,,,,,,,,
Travis d'Arnaud,1B/C,Rays,,723,518595,darnatr01,$2.84,103,351,88,16,,16,2,52,69,,1,32,,2,6,,.251,.312,.433,.326,,,,,,,,,,,,,,,
J.D. Davis,1B/3B/LF,Mets,,10929,605204,,$2.81,140,410,126,22,1,22,5,65,57,3,,38,2,3,2,,.307,.369,.527,.396,,,,,,,,,,,,,,,
Mark Canha,1B/CF/LF/RF,Athletics,,5757,592192,,$2.64,126,410,112,16,3,26,4,80,58,3,2,67,1,18,2,,.273,.396,.517,.402,,,,,,,,,,,,,,,
Jean Segura,SS,Phillies,,1744,516416,segurje01,$2.43,144,576,161,37,4,12,2,79,60,10,2,30,1,8,3,1,.280,.322,.420,.330,,,,,,,,,,,,,,,
Freddy Galvis,2B/SS,Blue Jays,,2342,520471,galvifr01,$1.52,147,557,145,28,1,23,6,67,70,4,2,28,1,1,2,1,.260,.295,.438,.326,,,,,,,,,,,,,,,
Scott Kingery,2B/3B/CF/SS,Phillies,,11701,664068,,$1.48,126,458,118,34,4,19,3,64,55,15,4,34,1,5,2,1,.258,.314,.474,.347,,,,,,,,,,,,,,,
Rhys Hoskins,1B/LF,Phillies,,11705,656555,,$1.48,160,570,129,33,5,29,4,86,85,2,2,116,6,11,6,,.226,.364,.454,.360,,,,,,,,,,,,,,,
Óscar Mercado,CF/LF/SS,Indians,,11432,640458,,$1.05,115,438,118,25,3,15,3,70,54,15,4,28,,5,4,7,.269,.313,.443,.339,,,,,,,,,,,,,,,
Dansby Swanson,SS,Braves,,11537,621020,,$1.00,127,483,121,26,3,17,3,77,65,10,5,51,2,5,5,1,.251,.325,.422,.331,,,,,,,,,,,,,,,
David Fletcher,2B/3B/LF/SS,Angels,,11343,664058,,$1.00,154,596,173,30,4,6,6,83,49,8,3,55,2,,1,1,.290,.349,.384,.336,,,,,,,,,,,,,,,
Albert Pujols,1B/DH,Angels,,3503,405395,pujolal01,$1.00,131,491,120,22,,23,4,55,93,3,,43,1,3,8,,.244,.305,.430,.325,,,,,,,,,,,,,,,
Hanser Alberto,2B/3B/SS,Orioles,,6484,593643,,$1.00,139,524,160,21,2,12,12,62,51,4,4,16,1,4,3,3,.305,.327,.422,.346,,,,,,,,,,,,,,,
Jose Iglesias,SS,Reds,,144,578428,iglesjo01,$1.00,146,504,145,21,3,11,3,62,59,6,6,20,3,3,2,1,.288,.317,.407,.318,,,,,,,,,,,,,,,
Tommy Edman,2B/3B/SS,Cardinals,,12388,669242,,$1.00,92,326,99,17,7,11,5,59,36,15,1,16,,7,,,.304,.350,.500,.389,,,,,,,,,,,,,,,
Eric Thames,1B/RF,Brewers,,798,519346,thameer01,$1.00,149,396,98,23,2,25,,67,61,3,2,51,4,10,2,,.247,.346,.505,.362,,,,,,,,,,,,,,,
Daniel Murphy,1B/2B,Rockies,,2133,502517,murphda08,$1.00,132,438,122,35,1,13,3,56,78,1,1,32,1,2,4,,.279,.328,.452,.342,,,,,,,,,,,,,,,
Joey Votto,1B,Reds,,2825,458015,vottojo01,$-1.86,142,525,137,32,1,15,9,79,47,5,,76,2,4,3,,.261,.357,.411,.356,,,,,,,,,,,,,,,
Luke Voit,1B/DH,Yankees,,11475,572228,,$-2.20,118,429,113,21,1,21,2,72,62,,,71,2,9,1,,.263,.378,.464,.373,,,,,,,,,,,,,,,
C.J. Cron,1B/DH,Twins,,6756,543068,,$-2.59,125,458,116,24,,25,5,51,78,,,29,3,10,2,,.253,.311,.469,.343,,,,,,,,,,,,,,,
Willy Adames,SS,Rays,,11563,642715,,$-2.78,152,531,135,25,1,20,6,69,52,4,2,46,1,3,1,3,.254,.315,.418,.331,,,,,,,,,,,,,,,
Daniel Vogelbach,1B/DH,Mariners,,6495,596129,,$-3.99,144,462,96,17,,30,2,73,76,,,92,2,2,2,,.208,.341,.439,.345,,,,,,,,,,,,,,,
Lourdes Gurriel Jr.,2B/LF/SS,Blue Jays,,11549,666971,,$-4.62,84,314,87,19,2,20,2,52,50,6,4,20,,5,3,1,.277,.327,.541,.372,,,,,,,,,,,,,,,
Carlos Correa,SS,Astros,,6438,621043,,$-4.79,75,280,78,16,1,21,2,42,59,1,,35,,2,4,,.279,.358,.568,.397,,,,,,,,,,,,,,,
Ian Desmond,1B/CF/LF,Rockies,,2521,435622,desmoia01,$-4.88,140,443,113,31,4,20,2,64,65,3,3,34,1,2,2,1,.255,.309,.479,.339,,,,,,,,,,,,,,,
Brandon Belt,1B,Giants,,4113,474832,beltbr01,$-4.90,156,526,123,32,3,17,2,76,57,4,3,83,3,3,4,,.234,.339,.403,.330,,,,,,,,,,,,,,,
Eric Sogard,2B/SS,Rays,,4832,519299,sogarer01,$-4.96,110,396,115,23,2,13,3,59,40,8,,38,2,2,3,3,.290,.351,.457,.363,,,,,,,,,,,,,,,
Ji Man Choi,1B/DH,Rays,,7377,596847,,$-5.34,127,410,107,20,2,19,2,54,63,2,3,64,2,6,7,,.261,.363,.459,.359,,,,,,,,,,,,,,,
Jurickson Profar,1B/2B/3B/SS,Athletics,,5170,595777,profaju01,$-5.77,139,459,100,24,2,20,1,65,67,9,1,48,2,8,3,,.218,.301,.410,.314,,,,,,,,,,,,,,,
Garrett Cooper,1B/RF,Marlins,,9475,643265,,$-6.16,107,381,107,16,1,15,3,52,50,,,33,,5,2,,.281,.344,.446,.352,,,,,,,,,,,,,,,
Mitch Moreland,1B,Red Sox,,4519,519048,morelmi01,$-6.72,91,298,75,17,1,19,3,48,58,1,,34,,1,2,,.252,.328,.507,.366,,,,,,,,,,,,,,,
Niko Goodrum,1B/2B/LF/SS,Tigers,,6048,592348,,$-7.74,112,423,105,27,5,12,3,61,45,12,3,46,1,1,2,,.248,.322,.421,.333,,,,,,,,,,,,,,,
Chris Taylor,2B/CF/LF/SS,Dodgers,,6789,621035,,$-8.15,124,366,96,29,4,12,3,52,52,8,,37,3,4,5,2,.262,.331,.462,.352,,,,,,,,,,,,,,,
Joey Gallo,1B/CF/LF,Rangers,,6323,608336,,$-8.25,70,241,61,15,1,22,,54,49,4,2,52,4,2,1,1,.253,.387,.598,.411,,,,,,,,,,,,,,,
Enrique Hernández,2B/CF/SS,Dodgers,,5301,571771,,$-8.34,130,414,98,19,1,17,2,57,64,4,,36,3,6,4,,.237,.304,.411,.316,,,,,,,,,,,,,,,
Victor Caratini,1B/C,Cubs,,10250,605170,,$-8.36,95,244,65,11,,11,2,31,34,1,,29,,3,3,,.266,.348,.447,.354,,,,,,,,,,,,,,,
Miguel Cabrera,1B/DH,Tigers,,1210,408234,cabremi01,$-8.76,136,493,139,21,,12,3,41,59,,,48,4,3,5,,.282,.346,.398,.333,,,,,,,,,,,,,,,
Didi Gregorius,SS,Yankees,,5332,544369,gregodi01,$-9.30,82,324,77,14,2,16,4,47,61,2,1,17,1,1,2,,.238,.276,.441,.317,,,,,,,,,,,,,,,
Miguel Rojas,1B/3B/SS,Marlins,,2847,500743,,$-9.35,132,483,137,29,1,5,3,52,46,9,5,32,2,5,5,1,.284,.331,.379,.319,,,,,,,,,,,,,,,
Marwin Gonzalez,1B/2B/3B/LF/RF/SS,Twins,,2731,503556,gonzama01,$-9.50,114,425,112,19,,15,1,52,55,1,,31,2,6,1,,.264,.322,.414,.325,,,,,,,,,,,,,,,
Michael Chavis,1B/2B/3B,Red Sox,,12321,656308,,$-9.52,95,347,88,10,1,18,2,46,58,2,1,31,2,4,,,.254,.322,.444,.337,,,,,,,,,,,,,,,
Orlando Arcia,SS,Brewers,,6093,606115,,$-9.89,152,494,110,16,1,15,4,51,59,8,5,43,5,1,6,2,.223,.282,.350,.282,,,,,,,,,,,,,,,
Andrelton Simmons,SS,Angels,,5583,592743,simmoan01,$-10.04,103,398,105,19,,7,1,47,40,10,2,24,1,2,,,.264,.309,.364,.304,,,,,,,,,,,,,,,
Jon Berti,2B/3B/CF/SS,Marlins,,11350,542932,,$-10.66,73,256,70,14,1,6,2,52,24,17,3,24,,6,1,,.273,.348,.406,.351,,,,,,,,,,,,,,,
Nick Ramirez,1B/RP,Tigers,,5714,598286,,$-10.75,3,1,,,,,,,,,,,,,,,,,,,46,79.67,76,11,74,35,4,1,36,5,4,,1.393,4.07,4.24
Matt Adams,1B,Nationals,,5355,571431,adamsma01,$-10.85,111,310,70,14,,20,2,42,56,,,20,1,2,1,,.226,.276,.465,.320,,,,,,,,,,,,,,,
Rowdy Tellez,1B/DH,Blue Jays,,11095,642133,,$-11.70,111,370,84,19,,21,1,49,54,1,1,29,3,7,3,,.227,.293,.449,.318,,,,,,,,,,,,,,,
Wilmer Flores,1B/2B,Diamondbacks,,2165,527038,florewi01,$-11.92,89,265,84,18,,9,1,31,37,,,15,,4,1,,.317,.361,.487,.372,,,,,,,,,,,,,,,
Jay Bruce,1B/LF/RF,Phillies,,2879,457803,bruceja01,$-11.93,98,310,67,17,,26,2,43,59,1,,19,,1,3,,.216,.261,.523,.333,,,,,,,,,,,,,,,
Brandon Dixon,1B/2B/LF,Tigers,,10875,641525,,$-12.02,117,391,97,20,4,15,4,41,52,5,1,21,,4,4,,.248,.290,.435,.323,,,,,,,,,,,,,,,
Brandon Crawford,SS,Giants,,4142,543063,crawfbr01,$-12.12,147,500,114,24,2,11,5,58,59,3,2,53,5,3,4,,.228,.304,.350,.296,,,,,,,,,,,,,,,
Justin Smoak,1B/DH,Blue Jays,,4469,475253,smoakju01,$-12.70,121,414,86,16,,22,3,54,61,,,79,3,6,1,,.208,.342,.406,.337,,,,,,,,,,,,,,,
John Hicks,1B/C/DH,Tigers,,5729,543308,,$-13.35,95,319,67,15,,13,4,29,35,1,1,13,,,1,,.210,.240,.379,.277,,,,,,,,,,,,,,,
Yandy Díaz,1B/3B,Rays,,10071,650490,,$-13.55,79,307,82,20,1,14,2,53,38,2,2,35,1,1,4,,.267,.340,.476,.355,,,,,,,,,,,,,,,
Matt Carpenter,1B/3B,Cardinals,,5070,572761,carpema01,$-13.89,129,416,94,20,2,15,2,59,46,6,1,63,,7,5,1,.226,.333,.392,.329,,,,,,,,,,,,,,,
Bo Bichette,SS,Blue Jays,,12258,666182,,$-14.79,46,196,61,18,,11,,32,21,4,4,14,,1,1,,.311,.358,.571,.391,,,,,,,,,,,,,,,
Jesús Aguilar,1B,Brewers,,6259,542583,,$-14.95,131,314,74,12,,12,2,39,50,,,43,,2,7,,.236,.325,.389,.320,,,,,,,,,,,,,,,
José Martínez,1B/LF/RF,Cardinals,,953,500874,,$-15.05,128,334,90,13,2,10,4,45,42,3,,35,,2,2,,.269,.340,.410,.344,,,,,,,,,,,,,,,
Pablo Sandoval,1B/3B,Giants,,4138,467055,sandopa01,$-15.39,108,272,73,23,,14,4,42,41,1,,18,2,1,3,2,.268,.311,.507,.359,,,,,,,,,,,,,,,
Matt Beaty,1B/LF,Dodgers,,12094,607461,,$-16.04,99,249,66,19,1,9,2,36,46,5,,17,2,2,,,.265,.317,.458,.344,,,,,,,,,,,,,,,
J.P. Crawford,SS,Mariners,,10626,641487,,$-16.59,93,345,78,21,4,7,4,43,46,5,3,43,,2,3,3,.226,.311,.371,.313,,,,,,,,,,,,,,,
Brock Holt,2B/3B/SS,Red Sox,,3344,571788,holtbr01,$-16.60,87,259,77,14,2,3,1,38,31,1,,28,1,4,4,,.297,.369,.402,.346,,,,,,,,,,,,,,,
Aledmys Díaz,1B/2B/3B/SS,Astros,,9486,649557,,$-17.09,69,210,57,12,1,9,4,36,40,2,,26,1,5,6,,.271,.356,.467,.371,,,,,,,,,,,,,,,
Brad Miller,1B/2B,Phillies,,5680,543543,millebr02,$-17.41,79,154,40,6,1,13,2,26,25,2,,15,,1,,,.260,.329,.565,.392,,,,,,,,,,,,,,,
Tim Beckham,3B/SS,Mariners,,587,542921,beckhti01,$-17.42,88,304,72,21,1,15,2,39,47,1,3,21,,3,,,.237,.293,.461,.325,,,,,,,,,,,,,,,
Neil Walker,1B/2B/3B,Marlins,,3334,435522,walkene01,$-17.71,115,337,88,19,1,8,2,37,38,3,,42,1,1,1,,.261,.344,.395,.335,,,,,,,,,,,,,,,
David Freese,1B/3B,Dodgers,,3514,501896,freesda01,$-18.55,79,162,51,13,,11,,35,29,,,23,,1,,,.315,.403,.599,.427,,,,,,,,,,,,,,,
Derek Dietrich,1B/2B/LF,Reds,,6087,518618,dietrde01,$-18.64,113,251,47,8,2,19,3,41,43,1,1,28,2,25,1,,.187,.328,.462,.348,,,,,,,,,,,,,,,
Mike Ford,1B,Yankees,,11833,645801,,$-18.82,50,143,37,7,,12,1,30,25,,,17,2,3,,,.259,.350,.559,.388,,,,,,,,,,,,,,,
Jake Bauers,1B/DH/LF,Indians,,10537,641343,,$-19.04,117,372,84,16,1,12,1,46,43,3,3,45,,3,3,,.226,.312,.371,.305,,,,,,,,,,,,,,,
José Osuna,1B/LF/RF,Pirates,,10677,591741,,$-19.11,95,261,69,20,,10,2,41,36,,,18,,1,4,,.264,.310,.456,.335,,,,,,,,,,,,,,,
Ronny Rodríguez,2B/SS,Tigers,,6414,500135,,$-19.33,84,276,61,12,3,14,2,29,43,3,1,13,,,5,,.221,.252,.438,.298,,,,,,,,,,,,,,,
Ronald Guzmán,1B,Rangers,,10050,608597,,$-19.78,87,256,56,20,,10,1,34,36,1,2,32,1,3,4,,.219,.308,.414,.314,,,,,,,,,,,,,,,
Austin Nola,1B/SS,Mariners,,6937,543592,,$-19.91,79,238,64,12,1,10,,37,31,1,,23,1,4,1,1,.269,.341,.454,.347,,,,,,,,,,,,,,,
José Peraza,2B/LF/SS,Reds,,6000,606299,,$-20.13,141,376,90,18,2,6,2,37,33,7,6,17,,8,2,,.239,.285,.346,.281,,,,,,,,,,,,,,,
Adeiny Hechavarría,2B/SS,Mets,,4952,588751,hechaad01,$-20.27,84,203,49,12,1,9,3,34,33,3,1,14,,3,1,,.241,.299,.443,.334,,,,,,,,,,,,,,,
Dominic Smith,1B/LF,Mets,,9995,642086,,$-20.38,89,177,50,10,,11,,35,25,1,2,19,,1,,,.282,.355,.525,.375,,,,,,,,,,,,,,,
Donovan Solano,2B/SS,Giants,,3516,456781,solando01,$-20.68,81,215,71,13,1,4,3,27,23,,1,10,,1,2,,.330,.360,.456,.366,,,,,,,,,,,,,,,
Dylan Moore,2B/3B/LF/SS,Mariners,,11457,664238,,$-20.76,113,247,51,14,2,9,,31,28,11,9,25,,9,,1,.206,.301,.389,.299,,,,,,,,,,,,,,,
Jordy Mercer,SS,Tigers,,3345,474568,mercejo03,$-21.29,74,256,69,16,,9,4,24,22,,,13,1,2,,,.270,.310,.438,.337,,,,,,,,,,,,,,,
Logan Forsythe,1B/2B/3B,Rangers,,3977,523253,forsylo01,$-21.90,101,317,72,17,1,7,3,38,39,2,,44,,3,2,,.227,.325,.353,.315,,,,,,,,,,,,,,,
Ryan O'Hearn,1B,Royals,,11624,656811,,$-21.97,105,328,64,13,1,14,,32,38,,1,39,1,1,2,,.195,.281,.369,.285,,,,,,,,,,,,,,,
Richie Martin,SS,Orioles,,11462,621006,,$-22.16,120,283,59,8,3,6,2,29,23,10,1,14,,6,1,5,.208,.256,.322,.271,,,,,,,,,,,,,,,
Ryan Zimmerman,1B,Nationals,,2519,475582,zimmery01,$-22.82,52,171,44,9,,6,1,20,27,,,17,,,2,,.257,.321,.415,.327,,,,,,,,,,,,,,,
Nathaniel Lowe,1B,Rays,,12115,663993,,$-22.88,50,152,40,8,,7,,24,19,,,13,,2,2,,.263,.325,.454,.337,,,,,,,,,,,,,,,
Dawel Lugo,2B/3B/SS,Tigers,,11062,608475,,$-22.92,77,273,67,11,4,6,3,28,26,,,8,1,3,4,,.245,.271,.381,.290,,,,,,,,,,,,,,,
Cheslor Cuthbert,1B/3B,Royals,,6848,596144,,$-22.96,87,309,76,14,,9,2,24,40,1,,19,1,2,,,.246,.294,.379,.302,,,,,,,,,,,,,,,
Ehire Adrianza,1B/2B/3B/SS,Twins,,4140,501303,adriaeh01,$-23.44,83,202,55,8,3,5,4,34,22,,2,20,1,6,4,2,.272,.346,.416,.346,,,,,,,,,,,,,,,
Mike Freeman,2B/SS,Indians,,5311,502273,,$-24.07,75,177,49,8,,4,2,27,24,1,2,22,,4,4,6,.277,.352,.390,.341,,,,,,,,,,,,,,,
Nicky Lopez,2B/SS,Royals,,12120,670032,,$-24.15,103,379,91,22,2,2,3,44,30,1,1,18,,1,,4,.240,.274,.325,.274,,,,,,,,,,,,,,,
Hernán Pérez,2B/3B/RF/SS,Brewers,,1245,541650,perezhe01,$-24.43,91,232,53,11,,8,2,29,18,5,1,11,,,1,2,.228,.260,.379,.289,,,,,,,,,,,,,,,
Addison Russell,2B/SS,Cubs,,6224,608365,,$-24.49,82,215,51,4,1,9,,25,23,2,,20,2,3,2,1,.237,.307,.391,.307,,,,,,,,,,,,,,,
Yonder Alonso,1B/DH,White Sox,,2819,475174,alonsyo01,$-24.66,121,292,58,13,,10,6,34,37,,1,39,3,2,2,,.199,.296,.346,.299,,,,,,,,,,,,,,,
Johan Camargo,3B/SS,Braves,,10256,622666,,$-24.87,98,232,54,12,1,7,2,31,32,1,,15,2,,,1,.233,.278,.384,.295,,,,,,,,,,,,,,,
Yairo Muñoz,2B/3B/OF/SS,Cardinals,,11158,622168,,$-25.22,88,172,46,7,1,2,1,20,13,8,3,7,,1,1,,.267,.298,.355,.297,,,,,,,,,,,,,,,
Chris Davis,1B,Orioles,,4462,448801,davisch02,$-25.43,105,307,55,9,,12,2,26,36,,,39,1,3,3,,.179,.276,.326,.275,,,,,,,,,,,,,,,
Sam Travis,1B,Red Sox,,10673,607752,,$-26.37,59,144,31,4,1,6,,17,16,2,,11,2,1,1,,.215,.274,.382,.285,,,,,,,,,,,,,,,
Justin Bour,1B,Angels,,2645,571506,,$-26.75,52,151,26,5,,8,1,18,26,,,17,,1,1,,.172,.259,.364,.279,,,,,,,,,,,,,,,
Tyler Austin,1B/DH/LF,Brewers,,5866,592122,,$-26.81,89,154,29,5,1,9,2,30,24,2,,24,1,,1,,.188,.296,.409,.319,,,,,,,,,,,,,,,
Ryon Healy,1B/3B,Mariners,,10898,592387,,$-26.96,47,169,40,16,,7,1,24,26,,,13,,1,4,,.237,.289,.456,.321,,,,,,,,,,,,,,,
Nico Hoerner,SS,Cubs,,12640,663538,,$-27.17,20,78,22,1,1,3,,13,17,,,3,1,,1,,.282,.305,.436,.315,,,,,,,,,,,,,,,
Jeimer Candelario,1B/3B,Tigers,,6041,600869,,$-27.18,94,335,68,17,2,8,2,33,32,3,1,43,1,7,1,,.203,.306,.337,.295,,,,,,,,,,,,,,,
Kevin Cron,1B,Diamondbacks,,11000,605196,,$-27.33,39,71,15,4,,6,1,12,16,,1,4,,2,1,,.211,.269,.521,.335,,,,,,,,,,,,,,,
Myles Straw,LF/SS,Astros,,11977,664702,,$-27.43,56,108,29,4,2,,,27,7,8,1,19,,,,1,.269,.375,.343,.344,,,,,,,,,,,,,,,
Tyler Wade,2B/SS,Yankees,,10822,642180,,$-27.78,43,94,23,3,1,2,,16,11,7,,11,,1,,2,.245,.324,.362,.328,,,,,,,,,,,,,,,
Daniel Robertson,2B/3B/SS,Rays,,7588,621002,,$-27.82,74,207,44,9,1,2,2,23,19,2,2,24,,6,,,.213,.312,.295,.287,,,,,,,,,,,,,,,
Marco Hernández,2B/3B/SS,Red Sox,,10013,593523,,$-27.95,61,148,37,7,,2,2,18,11,1,2,3,,3,,1,.250,.277,.338,.281,,,,,,,,,,,,,,,
Luis Urías,2B/SS,Padres,,11633,649966,,$-28.13,71,215,48,8,1,4,4,27,24,,1,25,,9,,,.223,.329,.326,.313,,,,,,,,,,,,,,,
Erik González,2B/3B/SS,Pirates,,6990,570481,,$-28.13,53,142,36,4,1,1,3,15,6,4,1,9,3,1,1,3,.254,.295,.317,.291,,,,,,,,,,,,,,,
Charlie Culberson,2B/3B/LF/SS,Braves,,5064,518586,culbech01,$-28.17,107,135,35,5,2,5,3,14,20,,1,6,,1,1,1,.259,.292,.437,.330,,,,,,,,,,,,,,,
Edwin Ríos,1B,Dodgers,,7531,621458,,$-28.63,28,47,13,2,1,4,,10,8,,,9,,,,,.277,.393,.617,.425,,,,,,,,,,,,,,,
Jake Lamb,1B/3B,Diamondbacks,,6457,571875,,$-28.68,78,187,36,8,2,6,2,26,30,1,,32,1,5,2,,.193,.323,.353,.313,,,,,,,,,,,,,,,
Austin Slater,1B/LF/RF,Giants,,11427,596103,,$-28.84,68,168,40,9,3,5,3,20,21,1,,22,1,2,,,.238,.333,.417,.345,,,,,,,,,,,,,,,
Mauricio Dubón,2B/SS,Giants,,11478,643289,,$-28.99,30,106,29,5,,4,3,12,9,3,1,5,,,,,.274,.306,.434,.349,,,,,,,,,,,,,,,
Mark Reynolds,1B,Rockies,,3664,448602,reynoma01,$-29.08,78,135,23,7,,4,,13,20,2,,22,,2,3,,.170,.290,.311,.277,,,,,,,,,,,,,,,
Matt Thaiss,1B/3B,Angels,,11644,642136,,$-29.39,53,147,31,7,,8,,17,23,,,17,,,,,.211,.293,.422,.311,,,,,,,,,,,,,,,
Wilmer Difo,2B/3B/SS,Nationals,,10495,594694,,$-29.40,43,131,33,2,,2,,15,8,,1,12,3,,,1,.252,.312,.313,.274,,,,,,,,,,,,,,,
Ryan Goins,2B/3B/SS,White Sox,,762,572365,goinsry01,$-29.48,52,144,36,6,1,2,,13,10,,1,17,1,1,,1,.250,.331,.347,.303,,,,,,,,,,,,,,,
Robel García,SS,Cubs,,10011,596825,,$-30.07,31,72,15,2,2,5,,8,11,,,7,,,1,,.208,.275,.500,.325,,,,,,,,,,,,,,,
Ryan McBroom,1B,Royals,,12038,643436,,$-30.47,23,75,22,5,,,,8,6,,,7,,1,,,.293,.361,.360,.327,,,,,,,,,,,,,,,
Cole Tucker,SS,Pirates,,11124,657061,,$-30.70,56,147,31,10,3,2,,16,13,,,10,1,1,,1,.211,.264,.361,.272,,,,,,,,,,,,,,,
Danny Mendick,SS,White Sox,,12105,664901,,$-31.19,16,39,12,,,2,1,6,4,,,1,,,,,.308,.325,.462,.365,,,,,,,,,,,,,,,
Tyler White,1B/DH,Dodgers,,11363,643603,,$-31.23,83,240,50,14,,3,1,18,23,,,36,,,3,,.208,.308,.304,.284,,,,,,,,,,,,,,,
Gavin Lux,2B/SS,Dodgers,,12174,666158,,$-31.38,23,75,18,4,1,2,,12,9,2,,7,,,,,.240,.305,.400,.316,,,,,,,,,,,,,,,
Christian Arroyo,SS,Rays,,10599,624414,,$-31.57,16,50,11,2,,2,,8,7,,,5,,1,,1,.220,.298,.380,.304,,,,,,,,,,,,,,,
Martín Prado,1B/3B,Marlins,,1843,445988,pradoma01,$-31.61,104,245,57,9,,2,1,26,15,,,12,,,3,,.233,.265,.294,.254,,,,,,,,,,,,,,,
Rangel Ravelo,1B,Cardinals,,10229,592660,,$-31.69,29,39,8,2,,2,,4,7,,,3,,,1,,.205,.256,.410,.284,,,,,,,,,,,,,,,
Hanley Ramírez,1B,Indians,,1999,434670,ramirha01,$-32.02,16,49,9,1,,2,1,4,8,,,8,,,,,.184,.298,.327,.301,,,,,,,,,,,,,,,
Seth Brown,1B/LF,Athletics,,12982,664913,,$-32.09,26,75,22,8,2,,,11,13,1,,7,,1,,,.293,.361,.453,.360,,,,,,,,,,,,,,,
Luis Guillorme,SS,Mets,,11471,641645,,$-32.34,45,61,15,4,,1,,8,3,,,7,,,,2,.246,.314,.361,.307,,,,,,,,,,,,,,,
Brendan Rodgers,SS,Rockies,,12539,663898,,$-32.65,25,76,17,2,,,1,8,7,,,4,,1,,,.224,.272,.250,.252,,,,,,,,,,,,,,,
Tyler Saladino,SS,Brewers,,5190,573135,,$-32.82,28,65,8,,,2,,7,8,2,,5,,1,,,.123,.197,.215,.199,,,,,,,,,,,,,,,
Jared Walsh,1B,Angels,,12408,665120,,$-32.89,31,79,16,5,1,1,,6,5,,,6,1,2,,,.203,.276,.329,.266,,,,,,,,,,,,,,,
Kristopher Negrón,3B/OF/SS,Dodgers,,2846,502117,negrokr01,$-33.13,40,77,19,1,,2,1,12,8,1,1,5,1,,,,.247,.293,.338,.285,,,,,,,,,,,,,,,
Bobby Bradley,1B,Indians,,11714,656252,,$-33.18,15,45,8,5,,1,1,4,4,,,4,,,,,.178,.245,.356,.281,,,,,,,,,,,,,,,
Greg Bird,1B,Yankees,,6291,595885,,$-33.20,10,35,6,,,1,,6,1,,,6,,,,,.171,.293,.257,.261,,,,,,,,,,,,,,,
Lucas Duda,1B/DH,Royals,,4970,446263,dudalu01,$-33.30,39,105,18,4,,4,1,7,15,,,11,1,1,2,,.171,.252,.324,.259,,,,,,,,,,,,,,,
JT Riddle,CF/SS,Marlins,,10125,595375,,$-33.33,51,132,25,6,,6,,15,12,,,5,1,2,,,.189,.230,.371,.257,,,,,,,,,,,,,,,
Richard Ureña,SS,Blue Jays,,10961,620446,,$-33.38,30,74,18,6,,,1,4,4,,,2,,1,,3,.243,.263,.324,.277,,,,,,,,,,,,,,,
Erick Mejia,SS,Royals,,11043,625510,,$-33.45,9,22,5,1,,,,3,4,,,4,,,1,,.227,.333,.273,.283,,,,,,,,,,,,,,,
Jack Mayfield,SS,Astros,,11639,608686,,$-33.45,26,64,10,5,,2,,8,5,,,1,,,,,.156,.169,.328,.210,,,,,,,,,,,,,,,
Cristhian Adames,SS,Giants,,5773,542436,,$-33.49,10,22,7,1,,,,1,2,,,2,,,,,.318,.375,.364,.335,,,,,,,,,,,,,,,
Edmundo Sosa,SS,Cardinals,,11594,624641,,$-33.66,8,8,2,,,,,2,,1,,1,,1,,,.250,.400,.250,.345,,,,,,,,,,,,,,,
Tzu-Wei Lin,SS,Red Sox,,10967,624407,,$-33.66,13,20,4,2,,,,3,1,1,1,2,,,,,.200,.273,.300,.248,,,,,,,,,,,,,,,