Player,Position,ProTeam,RotoTeam,RVid,MLBAMID,BDBID,RotoValue,pG,pIP,pH,pK,pBB,pER,pWin,pSav,pWHIP,pERA,bG,bAB,bH,bHR,bR,bRBI,bSB,bAvg
Marcell Ozuna,None,Braves,,4946,542303,ozunama01,$-0.00,,,,,,,,,,,76,283,89,21,46,64,,.314
Chris Sale,SP,Braves,,4967,519242,salech01,$-0.00,14,86.67,65,107,16,28,10,,0.935,2.91,,,,,,,,
Max Fried,SP,Braves,,6318,608331,,$-0.00,15,90.00,69,80,27,30,7,,1.067,3.00,,,,,,,,
Reynaldo López,RP,Braves,,11532,625643,,$-0.00,12,68.00,52,72,22,11,5,,1.088,1.46,,,,,,,,
Matt Olson,1B,Braves,,9384,621566,,$-0.00,,,,,,,,,,,76,284,70,12,36,40,,.246
Ozzie Albies,2B,Braves,,11728,645277,,$-0.00,,,,,,,,,,,68,275,71,6,38,38,5,.258
Ronald Acuña,RF,Braves,,11729,660670,,$-0.00,,,,,,,,,,,49,192,48,4,38,15,16,.250
Austin Riley,3B,Braves,,11974,663586,,$-0.00,,,,,,,,,,,63,243,61,8,38,30,,.251
Raisel Iglesias,RP,Braves,,10452,628452,,$-0.00,30,28.67,19,23,6,8,,20,0.872,2.51,,,,,,,,
Michael Harris,CF,Braves,,13591,671739,,$-0.00,,,,,,,,,,,67,260,65,5,30,20,8,.250
Jarred Kelenic,LF,Braves,,12425,672284,,$-0.00,,,,,,,,,,,63,200,54,7,23,21,2,.270
Charlie Morton,SP,Braves,,3278,450203,mortoch02,$-0.00,14,79.33,68,80,35,37,4,,1.298,4.20,,,,,,,,
Travis d'Arnaud,C,Braves,,723,518595,darnatr01,$-0.00,,,,,,,,,,,53,153,37,7,21,25,,.242
A.J. Minter,RP,Braves,,11866,621345,,$-0.00,25,21.33,15,23,6,7,5,1,0.984,2.95,,,,,,,,
Orlando Arcia,SS,Braves,,6093,606115,,$-0.00,,,,,,,,,,,76,274,58,6,24,22,,.212
Dylan Lee,RP,Braves,,13150,669276,,$-0.00,23,31.67,27,33,10,8,2,,1.168,2.27,,,,,,,,
Jesse Chavez,RP,Braves,,1776,445926,chaveje01,$-0.00,25,32.67,25,27,10,5,1,,1.071,1.38,,,,,,,,
Joe Jiménez,RP,Braves,,11842,641729,,$-0.00,30,30.00,20,33,10,9,1,1,1.000,2.70,,,,,,,,
Pierce Johnson,RP,Braves,,10615,572955,,$-0.00,26,25.33,23,33,11,10,2,1,1.342,3.55,,,,,,,,
Adam Duvall,CF,Braves,,6383,594807,,$-0.00,,,,,,,,,,,57,170,29,6,18,18,,.171
Aaron Bummer,RP,Braves,,11858,607481,,$-0.00,27,27.00,32,29,11,11,2,,1.593,3.67,,,,,,,,
Ramón Laureano,None,Braves,,11465,657656,,$-0.00,,,,,,,,,,,40,97,18,2,10,7,3,.186
Daysbel Hernández,RP,Braves,,13719,678226,,$-0.00,7,7.67,6,10,3,,1,,1.174,,,,,,,,,
Sean Murphy,C,Braves,,7262,669221,,$-0.00,,,,,,,,,,,19,67,13,3,6,8,,.194
Spencer Schwellenbach,SP,Braves,,16406,680885,,$-0.00,5,26.67,27,25,7,16,1,,1.275,5.40,,,,,,,,
Chadwick Tromp,C,Braves,,13095,644433,,$-0.00,,,,,,,,,,,19,52,13,,3,6,,.250
Grant Holmes,SP,Braves,,12356,656550,,$-0.00,3,5.00,3,3,,,,,0.600,,,,,,,,,
Forrest Wall,CF,Braves,,12486,657088,,$-0.00,,,,,,,,,,,6,11,3,,1,1,2,.273
Ray Kerr,RP,Braves,,13870,678061,,$-0.00,10,22.33,29,27,7,14,1,,1.612,5.64,,,,,,,,
Zack Short,None,Braves,,12563,670097,,$-0.00,,,,,,,,,,,29,56,7,,9,3,2,.125
AJ Smith-Shawver,SP,Braves,,14244,700363,,$-0.00,1,4.33,3,4,2,,,,1.154,,,,,,,,,
Joey Wendle,None,Braves,,6992,621563,,$-0.00,,,,,,,,,,,18,36,8,,3,1,1,.222
J.P. Martinez,CF,Braves,,13425,679881,,$-0.00,,,,,,,,,,,7,10,2,,2,,1,.200
Jimmy Herget,RP,Braves,,12170,623474,,$-0.00,5,7.33,8,6,2,3,,,1.364,3.68,,,,,,,,
Luke Williams,None,Braves,,13073,663897,,$-0.00,1,1.00,,,,,,,,,7,3,,,1,,,
David Fletcher,SS,Braves,,11343,664058,,$-0.00,,,,,,,,,,,5,8,2,,,2,,.250
Jackson Stephens,RP,Braves,,11554,623451,,$-0.00,3,3.33,5,2,1,1,,,1.800,2.70,,,,,,,,
Brian Anderson,DH,Braves,,10964,605119,,$-0.00,,,,,,,,,,,,,,,,,,
Angel Perdomo,RP,Braves,,12502,622780,,$-0.00,,,,,,,,,,,,,,,,,,
Huascar Ynoa,SP,Braves,,12309,660623,,$-0.00,,,,,,,,,,,,,,,,,,
Spencer Strider,SP,Braves,,13864,675911,,$-0.00,2,9.00,10,12,5,7,,,1.667,7.00,,,,,,,,
Allan Winans,SP,Braves,,14190,642216,,$-0.00,1,5.00,8,1,2,6,,,2.000,10.80,,,,,,,,
Darius Vines,SP,Braves,,13983,670241,,$-0.00,3,12.67,17,8,4,11,,,1.658,7.82,,,,,,,,
Bryce Elder,SP,Braves,,13971,693821,,$-0.00,5,23.67,35,19,11,17,1,,1.944,6.46,,,,,,,,
Tyler Matzek,RP,Braves,,7126,554431,,$-0.00,11,10.00,16,10,3,11,,,1.900,9.90,,,,,,,,
Hurston Waldrep,SP,Braves,,16044,694462,,$-0.00,2,7.00,9,3,8,13,,,2.429,16.71,,,,,,,,
