Player,Position,ProTeam,RotoTeam,RVid,pG,pIP,pH,pHR,pK,pBB,pIBB,pHB,pR,pER,pWin,pL,pSav,pHld,pS+H,pQS,pWHIP,pERA,pR/9,pFIP,bG,bAB,bH,b2B,b3B,bHR,bRBOE,bTB,bR,bRBI,bSB,bCS,bBB,bIBB,bHBP,bSF,bSH,bAvg,bOBP,bSlg,bwOBA
Mike Adams,RP,Phillies,,3888,28,25.00,23,5,23,11,,,11,11,1,4,,8,8,,1.360,3.96,3.96,5.18,25,,,,,,,,,,,,,,,,,,,,
Adrian Alaniz,SP,Phillies,,5490,,,,,,,,,,,,,,,,,,,,3.10,,,,,,,,,,,,,,,,,,,,,
Cody Asche,3B,Phillies,,6253,,,,,,,,,,,,,,,,,,,,,50,162,38,8,1,5,,63,18,22,1,,15,3,1,1,,.235,.302,.389,.299
Phillippe Aumont,RP,Phillies,,2251,22,19.33,24,,19,13,1,3,11,9,1,3,,1,1,,1.914,4.19,5.12,3.46,20,,,,,,,,,,,,,,,,,,,,
Manny Ayala,SP,Phillies,,2278,,,,,,,,,,,,,,,,,,,,3.10,,,,,,,,,,,,,,,,,,,,,
Brian Bass,RP,Phillies,,3231,,,,,,,,,,,,,,,,,,,,3.10,,,,,,,,,,,,,,,,,,,,,
Antonio Bastardo,RP,Phillies,,2253,48,42.67,33,2,47,21,1,1,12,11,3,2,2,14,16,,1.266,2.32,2.53,2.98,44,,,,,,,,,,,,,,,,,,,,
Leonel Bastidas,SP,Phillies,,5497,,,,,,,,,,,,,,,,,,,,3.10,,,,,,,,,,,,,,,,,,,,,
Roger Bernadina,CF,Phillies,,2549,,,,,,,,,,,,,,,,,,,,,112,227,41,10,2,4,,67,26,11,4,,16,1,5,,2,.181,.248,.295,.248
T.J. Bohn,LF,Phillies,,2363,,,,,,,,,,,,,,,,,,,,,,,,,,,,,,,,,,,,,,,,,
Sebastien Boucher,OF,Phillies,,482,,,,,,,,,,,,,,,,,,,,,,,,,,,,,,,,,,,,,,,,,
Tagg Bozied,3B,Phillies,,3322,,,,,,,,,,,,,,,,,,,,,,,,,,,,,,,,,,,,,,,,,
Domonic Brown,LF,Phillies,,2380,,,,,,,,,,,,,,,,,,,,,139,496,135,21,4,27,,245,65,83,8,3,39,5,1,4,,.272,.324,.494,.348
Mark Budzinski,RF,Phillies,,2381,,,,,,,,,,,,,,,,,,,,,,,,,,,,,,,,,,,,,,,,,
Nate Bump,RP,Phillies,,2256,,,,,,,,,,,,,,,,,,,,3.10,,,,,,,,,,,,,,,,,,,,,
Gary Burnham,1B,Phillies,,2317,,,,,,,,,,,,,,,,,,,,,,,,,,,,,,,,,,,,,,,,,
Ron Calloway,OF,Phillies,,2371,,,,,,,,,,,,,,,,,,,,,,,,,,,,,,,,,,,,,,,,,
Lou Collier,RF,Phillies,,2382,,,,,,,,,,,,,,,,,,,,,,,,,,,,,,,,,,,,,,,,,
Casey Craig,CF,Phillies,,2352,,,,,,,,,,,,,,,,,,,,,,,,,,,,,,,,,,,,,,,,,
Juan Cruz,RP,Phillies,,1322,,,,,,,,,,,,,,,,,,,,3.10,,,,,,,,,,,,,,,,,,,,,
Justin De Fratus,RP,Phillies,,2228,58,46.67,45,3,42,25,3,5,21,19,3,3,,9,9,,1.500,3.66,4.05,3.87,54,,,,,,,,,,,,,,,,,,,,
Javis Diaz,CF,Phillies,,2353,,,,,,,,,,,,,,,,,,,,,,,,,,,,,,,,,,,,,,,,,
Jake Diekman,RP,Phillies,,5521,45,38.33,33,1,41,16,2,,15,11,1,4,,11,11,,1.278,2.58,3.52,2.40,43,,,,,,,,,,,,,,,,,,,,
Chris Duffy,CF,Phillies,,2354,,,,,,,,,,,,,,,,,,,,,,,,,,,,,,,,,,,,,,,,,
Chad Durbin,RP,Phillies,,2260,16,16.00,25,4,16,9,1,,17,16,1,,,,,,2.125,9.00,9.56,5.85,15,,,,,,,,,,,,,,,,,,,,
Jason Ellison,LF,Phillies,,2364,,,,,,,,,,,,,,,,,,,,,,,,,,,,,,,,,,,,,,,,,
John Ennis,RP,Phillies,,2261,,,,,,,,,,,,,,,,,,,,3.10,,,,,,,,,,,,,,,,,,,,,
Brandon Erbe,SP,Phillies,,401,,,,,,,,,,,,,,,,,,,,3.10,,,,,,,,,,,,,,,,,,,,,
Ryan Fleming,OF,Phillies,,2372,,,,,,,,,,,,,,,,,,,,,,,,,,,,,,,,,,,,,,,,,
Mike Floyd,OF,Phillies,,2373,,,,,,,,,,,,,,,,,,,,,,,,,,,,,,,,,,,,,,,,,
Josh Fogg,SP,Phillies,,2282,,,,,,,,,,,,,,,,,,,,3.10,,,,,,,,,,,,,,,,,,,,,
Kevin Frandsen,3B,Phillies,,119,,,,,,,,,,,,,,,,,,,,,119,252,59,10,1,5,,86,27,26,1,,12,,11,2,1,.234,.295,.341,.286
Chris Frey,CF,Phillies,,3830,,,,,,,,,,,,,,,,,,,,,,,,,,,,,,,,,,,,,,,,,
Austin Gallagher,1B,Phillies,,4638,,,,,,,,,,,,,,,,,,,,,,,,,,,,,,,,,,,,,,,,,
Freddy Galvis,2B,Phillies,,2342,,,,,,,,,,,,,,,,,,,,,70,205,48,5,4,6,,79,13,19,1,,13,1,1,,3,.234,.279,.385,.292
Sean Gamble,OF,Phillies,,2374,,,,,,,,,,,,,,,,,,,,,,,,,,,,,,,,,,,,,,,,,
Luis García,RP,Phillies,,7302,24,31.33,27,3,23,23,,1,15,13,1,1,,1,1,,1.596,3.73,4.31,5.17,22,2,,,,,,,,,,,,,,,,,,,
Tim Gradoville,C,Phillies,,2303,,,,,,,,,,,,,,,,,,,,,,,,,,,,,,,,,,,,,,,,,
Steve Green,SP,Phillies,,2283,,,,,,,,,,,,,,,,,,,,3.10,,,,,,,,,,,,,,,,,,,,,
Kyle Haines,SS,Phillies,,2343,,,,,,,,,,,,,,,,,,,,,,,,,,,,,,,,,,,,,,,,,
Roy Halladay,SP,Phillies,,2284,13,62.00,55,12,51,36,1,9,48,47,4,5,,,,6,1.468,6.82,6.97,6.10,12,18,,,,,,,,1,,,1,,,,1,,.050,,.037
Cole Hamels,SP,Phillies,,2285,33,220.00,205,21,202,50,5,8,94,88,8,14,,,,25,1.159,3.60,3.85,3.23,31,56,10,1,1,,,13,4,5,,1,1,,1,,13,.179,.169,.232,.189
Joey Hammond,3B,Phillies,,2332,,,,,,,,,,,,,,,,,,,,,,,,,,,,,,,,,,,,,,,,,
Buzz Hannahan,3B,Phillies,,2333,,,,,,,,,,,,,,,,,,,,,,,,,,,,,,,,,,,,,,,,,
Brad Harman,2B,Phillies,,2323,,,,,,,,,,,,,,,,,,,,,,,,,,,,,,,,,,,,,,,,,
Yoel Hernandez,SP,Phillies,,2287,,,,,,,,,,,,,,,,,,,,3.10,,,,,,,,,,,,,,,,,,,,,
César Hernández,2B,Phillies,,5172,,,,,,,,,,,,,,,,,,,,,34,121,35,5,,,,40,17,10,,3,9,,1,,,.289,.344,.331,.296
Jason Hill,C,Phillies,,2304,,,,,,,,,,,,,,,,,,,,,,,,,,,,,,,,,,,,,,,,,
Brian Hitchcox,2B,Phillies,,2324,,,,,,,,,,,,,,,,,,,,,,,,,,,,,,,,,,,,,,,,,
Jeremy Horst,RP,Phillies,,2771,28,26.00,35,4,21,12,1,2,19,18,,2,,2,2,,1.808,6.23,6.58,4.98,26,,,,,,,,,,,,,,,,,,,,
Ryan Howard,1B,Phillies,,2318,,,,,,,,,,,,,,,,,,,,,80,286,76,20,2,11,,133,34,43,,,23,4,2,6,,.266,.319,.465,.331
Austin Hyatt,RP,Phillies,,5607,,,,,,,,,,,,,,,,,,,,3.10,,,,,,,,,,,,,,,,,,,,,
Steven Inch,RP,Phillies,,6965,,,,,,,,,,,,,,,,,,,,3.10,,,,,,,,,,,,,,,,,,,,,
Jeff Inglin,OF,Phillies,,2375,,,,,,,,,,,,,,,,,,,,,,,,,,,,,,,,,,,,,,,,,
Greg Jacobs,RF,Phillies,,2384,,,,,,,,,,,,,,,,,,,,,,,,,,,,,,,,,,,,,,,,,
Cesar Jimenez,RP,Phillies,,4262,19,17.00,14,1,11,10,,1,7,7,1,1,,,,,1.412,3.71,3.71,4.51,19,,,,,,,,,,,,,,,,,,,,
Kyle Kendrick,SP,Phillies,,2288,30,182.00,207,18,110,47,4,7,104,95,10,13,,,,17,1.396,4.70,5.14,4.00,32,56,7,1,1,,,10,1,2,,,1,,1,,8,.125,.136,.179,.151
Tim Kennelly,3B,Phillies,,5277,,,,,,,,,,,,,,,,,,,,,,,,,,,,,,,,,,,,,,,,,
Chris Klemm,OF,Phillies,,2376,,,,,,,,,,,,,,,,,,,,,,,,,,,,,,,,,,,,,,,,,
Jon Knott,LF,Phillies,,2367,,,,,,,,,,,,,,,,,,,,,,,,,,,,,,,,,,,,,,,,,
Erik Kratz,C,Phillies,,3315,,,,,,,,,,,,,,,,,,,,,68,197,42,7,,9,,76,21,26,,,18,4,1,2,,.213,.280,.386,.283
Kyle Lafrenz,DH,Phillies,,5418,,,,,,,,,,,,,,,,,,,,,,,,,,,,,,,,,,,,,,,,,
John Lannan,SP,Phillies,,2457,14,74.33,86,6,38,27,1,5,48,44,3,6,,,,6,1.520,5.33,5.81,4.38,14,21,4,1,,,,5,2,1,,,2,,,,2,.190,.240,.238,.233
Peter Lavin,CF,Phillies,,5865,,,,,,,,,,,,,,,,,,,,,,,,,,,,,,,,,,,,,,,,,
Cliff Lee,SP,Phillies,,4264,31,222.67,193,22,222,32,,4,77,71,14,8,,,,24,1.010,2.87,3.11,2.88,31,60,11,1,1,,,14,5,6,,2,2,,,,10,.183,.181,.233,.183
Steven Lerud,C,Phillies,,423,,,,,,,,,,,,,,,,,,,,,6,5,,,,,,,,,,,,,,,,,,,
Derrick Loop,RP,Phillies,,5413,,,,,,,,,,,,,,,,,,,,3.10,,,,,,,,,,,,,,,,,,,,,
Rodrigo Lopez,SP,Phillies,,3620,,,,,,,,,,,,,,,,,,,,3.10,,,,,,,,,,,,,,,,,,,,,
Chris Lubanski,LF,Phillies,,780,,,,,,,,,,,,,,,,,,,,,,,,,,,,,,,,,,,,,,,,,
Ebelin Lugo,RP,Phillies,,5414,,,,,,,,,,,,,,,,,,,,3.10,,,,,,,,,,,,,,,,,,,,,
Jason Mackintosh,SP,Phillies,,2289,,,,,,,,,,,,,,,,,,,,3.10,,,,,,,,,,,,,,,,,,,,,
Kevin Mahar,RF,Phillies,,2386,,,,,,,,,,,,,,,,,,,,,,,,,,,,,,,,,,,,,,,,,
Ethan Martin,SP,Phillies,,4606,15,40.00,42,9,47,26,2,1,27,27,2,5,,,,1,1.700,6.08,6.08,5.55,15,9,,,,,,,,,,,,,,,1,,,,
Michael Martínez,2B,Phillies,,2504,,,,,,,,,,,,,,,,,,,,,29,40,7,,,,,7,5,3,1,,,,,,,.175,.175,.175,.164
John Mayberry,CF,Phillies,,2368,,,,,,,,,,,,,,,,,,,,,134,353,80,23,1,11,,138,47,39,5,3,27,1,3,1,,.227,.286,.391,.295
Luis Maza,2B,Phillies,,2326,,,,,,,,,,,,,,,,,,,,,,,,,,,,,,,,,,,,,,,,,
Brian Mazone,SP,Phillies,,2291,,,,,,,,,,,,,,,,,,,,3.10,,,,,,,,,,,,,,,,,,,,,
Anthony Medrano,SS,Phillies,,2344,,,,,,,,,,,,,,,,,,,,,,,,,,,,,,,,,,,,,,,,,
Curt Miaso,OF,Phillies,,2377,,,,,,,,,,,,,,,,,,,,,,,,,,,,,,,,,,,,,,,,,
Matt Miller,LF,Phillies,,3840,,,,,,,,,,,,,,,,,,,,,,,,,,,,,,,,,,,,,,,,,
Zach Miner,RP,Phillies,,1160,16,28.67,33,4,20,17,1,2,14,14,,2,,,,,1.744,4.40,4.40,5.40,16,6,2,,,,,2,,,,,,,,,,.333,.333,.333,.300
Kenny Miramontes,SS,Phillies,,5502,,,,,,,,,,,,,,,,,,,,,,,,,,,,,,,,,,,,,,,,,
Derek Mitchell,OF,Phillies,,5712,,,,,,,,,,,,,,,,,,,,,,,,,,,,,,,,,,,,,,,,,
Jose Mojica,SS,Phillies,,6080,,,,,,,,,,,,,,,,,,,,,,,,,,,,,,,,,,,,,,,,,
Javon Moran,CF,Phillies,,2357,,,,,,,,,,,,,,,,,,,,,,,,,,,,,,,,,,,,,,,,,
Juan Morillo,RP,Phillies,,1485,,,,,,,,,,,,,,,,,,,,3.10,,,,,,,,,,,,,,,,,,,,,
Timothy Moss,2B,Phillies,,2327,,,,,,,,,,,,,,,,,,,,,,,,,,,,,,,,,,,,,,,,,
Joel Naughton,C,Phillies,,2306,,,,,,,,,,,,,,,,,,,,,,,,,,,,,,,,,,,,,,,,,
Kevin Nelson,C,Phillies,,2307,,,,,,,,,,,,,,,,,,,,,,,,,,,,,,,,,,,,,,,,,
Scott Nestor,RP,Phillies,,2270,,,,,,,,,,,,,,,,,,,,3.10,,,,,,,,,,,,,,,,,,,,,
Laynce Nix,RF,Phillies,,2869,,,,,,,,,,,,,,,,,,,,,81,128,23,4,,2,,33,11,7,1,,8,2,,,,.180,.228,.258,.215
Jacob Opitz,1B,Phillies,,6137,,,,,,,,,,,,,,,,,,,,,,,,,,,,,,,,,,,,,,,,,
Pete Orr,2B,Phillies,,2505,,,,,,,,,,,,,,,,,,,,,15,20,4,,,,,4,1,,,,2,,,,,.200,.273,.200,.227
Jonathan Papelbon,RP,Phillies,,53,61,61.67,59,6,57,11,1,1,23,20,5,1,29,,29,,1.135,2.92,3.36,3.05,58,,,,,,,,,,,,,,,,,,,,
Carlos Perdomo,3B,Phillies,,5864,,,,,,,,,,,,,,,,,,,,,,,,,,,,,,,,,,,,,,,,,
Jonathan Pettibone,SP,Phillies,,6156,18,100.33,109,9,66,38,3,5,50,45,5,4,,,,8,1.465,4.04,4.49,4.15,17,29,3,1,,,,4,4,,,,3,,,,,.103,.188,.138,.161
Justin Pope,SP,Phillies,,2293,,,,,,,,,,,,,,,,,,,,3.10,,,,,,,,,,,,,,,,,,,,,
Trent Pratt,C,Phillies,,2308,,,,,,,,,,,,,,,,,,,,,,,,,,,,,,,,,,,,,,,,,
John Purdom,C,Phillies,,2309,,,,,,,,,,,,,,,,,,,,,,,,,,,,,,,,,,,,,,,,,
Roman Quinn,SS,Phillies,,6510,,,,,,,,,,,,,,,,,,,,,,,,,,,,,,,,,,,,,,,,,
Miguel Quintana,OF,Phillies,,2378,,,,,,,,,,,,,,,,,,,,,,,,,,,,,,,,,,,,,,,,,
Arlon Quiroz,LF,Phillies,,2369,,,,,,,,,,,,,,,,,,,,,,,,,,,,,,,,,,,,,,,,,
JC Ramírez,SP,Phillies,,2294,18,24.00,30,6,16,15,1,,22,20,,1,,3,3,,1.875,7.50,8.25,6.77,17,1,,,,,,,,,,,,,,,,,,,
Ben Revere,CF,Phillies,,1559,,,,,,,,,,,,,,,,,,,,,88,315,96,9,3,,,111,37,17,22,8,16,1,,,5,.305,.333,.352,.314
Mauricio Robles,SP,Phillies,,4269,3,4.67,7,,6,3,,,3,1,,,,,,,2.143,1.93,5.79,2.46,3,,,,,,,,,,,,,,,,,,,,
Jimmy Rollins,SS,Phillies,,2345,,,,,,,,,,,,,,,,,,,,,160,600,151,36,2,6,,209,65,39,22,6,59,6,1,3,3,.252,.317,.348,.300
B.J. Rosenberg,RP,Phillies,,2272,22,19.67,20,,19,9,1,,10,10,2,,1,2,3,,1.475,4.58,4.58,2.39,22,,,,,,,,,,,,,,,,,,,,
Mike Rouse,SS,Phillies,,2346,,,,,,,,,,,,,,,,,,,,,,,,,,,,,,,,,,,,,,,,,
Wilkin Ruan,CF,Phillies,,2358,,,,,,,,,,,,,,,,,,,,,,,,,,,,,,,,,,,,,,,,,
Darin Ruf,LF,Phillies,,5415,,,,,,,,,,,,,,,,,,,,,73,251,62,11,,14,,115,36,30,,,33,1,7,2,,.247,.348,.458,.351
Carlos Ruiz,C,Phillies,,2310,,,,,,,,,,,,,,,,,,,,,92,310,83,16,,5,,114,30,37,1,,18,3,7,2,4,.268,.317,.368,.304
Cameron Rupp,C,Phillies,,6513,,,,,,,,,,,,,,,,,,,,,4,13,4,1,,,,5,1,2,,,1,,,,,.308,.357,.385,.332
Jim Rushford,OF,Phillies,,2379,,,,,,,,,,,,,,,,,,,,,,,,,,,,,,,,,,,,,,,,,
Jeremy Salazar,C,Phillies,,2311,,,,,,,,,,,,,,,,,,,,,,,,,,,,,,,,,,,,,,,,,
Joe Savery,RP,Phillies,,2296,18,20.00,15,1,14,11,,,11,7,2,,,1,1,,1.300,3.15,4.95,4.00,17,,,,,,,,,,,,,,,,1,,,,
Brian Schneider,C,Phillies,,2313,,,,,,,,,,,,,,,,,,,,,,,,,,,,,,,,,,,,,,,,,
Josh Shortslef,SP,Phillies,,2297,,,,,,,,,,,,,,,,,,,,3.10,,,,,,,,,,,,,,,,,,,,,
Jeremy Slayden,RF,Phillies,,2387,,,,,,,,,,,,,,,,,,,,,,,,,,,,,,,,,,,,,,,,,
Juan Sosa,3B,Phillies,,2337,,,,,,,,,,,,,,,,,,,,,,,,,,,,,,,,,,,,,,,,,
Mike Spidale,LF,Phillies,,2370,,,,,,,,,,,,,,,,,,,,,,,,,,,,,,,,,,,,,,,,,
Jason Standridge,SP,Phillies,,2298,,,,,,,,,,,,,,,,,,,,3.10,,,,,,,,,,,,,,,,,,,,,
Brian Stavisky,RF,Phillies,,2388,,,,,,,,,,,,,,,,,,,,,,,,,,,,,,,,,,,,,,,,,
Jason Stephens,SP,Phillies,,218,,,,,,,,,,,,,,,,,,,,3.10,,,,,,,,,,,,,,,,,,,,,
Michael Stutes,RP,Phillies,,2248,16,17.67,14,1,9,8,1,1,11,9,3,1,,3,3,,1.245,4.58,5.60,4.18,14,1,,,,,,,,,,,,,,,,,,,
Steve Susdorf,LF,Phillies,,5710,,,,,,,,,,,,,,,,,,,,,3,7,1,1,,,,2,1,,,,,,,,,.143,.143,.286,.179
Brandon Tripp,LF,Phillies,,4942,,,,,,,,,,,,,,,,,,,,,,,,,,,,,,,,,,,,,,,,,
Chase Utley,2B,Phillies,,2329,,,,,,,,,,,,,,,,,,,,,131,476,135,25,6,18,,226,73,69,8,3,45,4,5,5,,.284,.348,.475,.355
John Vanden Berg,C,Phillies,,2315,,,,,,,,,,,,,,,,,,,,,,,,,,,,,,,,,,,,,,,,,
Jesus Villegas Andino,SS,Phillies,,2348,,,,,,,,,,,,,,,,,,,,,,,,,,,,,,,,,,,,,,,,,
Chris Walker,CF,Phillies,,2360,,,,,,,,,,,,,,,,,,,,,,,,,,,,,,,,,,,,,,,,,
Ehren Wassermann,RP,Phillies,,2275,,,,,,,,,,,,,,,,,,,,3.10,,,,,,,,,,,,,,,,,,,,,
Dusty Wathan,C,Phillies,,2316,,,,,,,,,,,,,,,,,,,,,,,,,,,,,,,,,,,,,,,,,
Casper Wells,RF,Phillies,,1287,,,,,,,,,,,,,,,,,,,,,52,95,12,2,,,,14,6,1,,1,7,,,,,.126,.186,.147,.156
Bill White,RP,Phillies,,2276,,,,,,,,,,,,,,,,,,,,3.10,,,,,,,,,,,,,,,,,,,,,
Ryne White,1B,Phillies,,2654,,,,,,,,,,,,,,,,,,,,,,,,,,,,,,,,,,,,,,,,,
Dennis Winn,SS,Phillies,,2349,,,,,,,,,,,,,,,,,,,,,,,,,,,,,,,,,,,,,,,,,
Jake Woods,SP,Phillies,,2300,,,,,,,,,,,,,,,,,,,,3.10,,,,,,,,,,,,,,,,,,,,,
Carlos Zambrano,SP,Phillies,,2627,,,,,,,,,,,,,,,,,,,,3.10,,,,,,,,,,,,,,,,,,,,,
