Player,Position,ProTeam,RotoTeam,RVid,MLBAMID,BDBID,RotoValue,bG,bAB,bH,b2B,b3B,bHR,bRBOE,bR,bRBI,bSB,bCS,bBB,bIBB,bHBP,bSF,bSH,bAvg,bOBP,bSlg,bwOBA,pG,pIP,pBF,pH,pHR,pK,pPO,pFO,pGO,pLO,pSF,pSH,pBB,pIBB,pHB,pR,pER,pWin,pL,pSav,pStk,pFoul,piBall,pPit,pStk%,pWHIP,pERA,pR/9,pFIP,pkwERA
Johnny Cueto,SP,Reds,,2789,456501,cuetojo01,$43.25,,,,,,,,,,,,,,,,,,,,,34,243.67,961,169,22,242,,,,,,,65,2,15,69,61,20,9,,2380,,,3659,69.7%,0.960,2.25,2.55,3.25,3.35
José Abreu,1B/DH,White Sox,,7346,547989,,$36.39,145,556,176,35,2,36,,80,107,3,1,51,15,11,4,,.317,.383,.581,.403,,,,,,,,,,,,,,,,,,,,,,,,,,,,,,
Anthony Rendon,2B/3B,Nationals,,5551,543685,rendoan01,$30.27,153,613,176,39,6,21,,111,83,17,3,58,2,5,5,2,.287,.350,.473,.361,,,,,,,,,,,,,,,,,,,,,,,,,,,,,,
Charlie Blackmon,CF/LF/RF,Rockies,,5147,453568,blackch02,$25.14,154,593,171,27,3,19,,82,72,28,10,31,5,13,5,6,.288,.332,.440,.339,,,,,,,,,,,,,,,,,,,,,,,,,,,,,,
Matt Kemp,CF/LF/RF,Dodgers,,4676,461314,kempma01,$23.03,150,541,155,38,3,25,,77,89,8,5,52,3,,6,,.287,.346,.506,.363,,,,,,,,,,,,,,,,,,,,,,,,,,,,,,
Dee Strange-Gordon,2B/SS,Dodgers,,4670,543829,gordode01,$23.03,148,609,176,24,12,2,,92,34,64,19,31,,4,3,3,.289,.325,.378,.322,,,,,,,,,,,,,,,,,,,,,,,,,,,,,,
Corey Dickerson,CF/LF,Rockies,,6308,572816,dickeco01,$21.43,131,436,136,27,6,24,,74,76,8,7,37,6,1,4,,.312,.364,.567,.388,,,,,,,,,,,,,,,,,,,,,,,,,,,,,,
Lucas Duda,1B/LF,Mets,,4970,446263,dudalu01,$19.15,153,514,130,27,,30,,74,92,3,2,69,8,9,4,,.253,.349,.481,.354,,,,,,,,,,,,,,,,,,,,,,,,,,,,,,
Devin Mesoraco,C,Reds,,2815,519023,mesorde01,$18.51,114,384,105,25,,25,,54,80,1,3,41,4,12,3,,.273,.359,.534,.376,,,,,,,,,,,,,,,,,,,,,,,,,,,,,,
Garrett Richards,RP/SP,Angels,,1630,572070,richaga01,$17.69,,,,,,,,,,,,,,,,,,,,,26,168.67,678,124,5,164,,,,,,,51,1,7,51,49,13,4,,1651,,,2627,67.6%,1.038,2.61,2.72,2.55,3.50
Melky Cabrera,LF,Blue Jays,,1869,466320,cabreme01,$17.29,139,568,171,35,3,16,,81,73,6,2,43,3,3,5,2,.301,.349,.458,.351,,,,,,,,,,,,,,,,,,,,,,,,,,,,,,
Yan Gomes,C,Indians,,5592,543228,gomesya01,$17.23,135,485,135,25,3,21,,61,74,,,24,3,3,6,,.278,.313,.472,.334,,,,,,,,,,,,,,,,,,,,,,,,,,,,,,
J.D. Martinez,LF/RF,Tigers,,5186,502110,martijd02,$17.23,123,441,139,30,3,23,,57,76,6,3,30,5,3,6,,.315,.358,.553,.384,,,,,,,,,,,,,,,,,,,,,,,,,,,,,,
Phil Hughes,SP,Twins,,252,461833,hugheph01,$16.83,,,,,,,,,,,,,,,,,,,,,32,209.67,832,221,16,186,,,,,,,16,1,5,88,82,16,10,,2224,,,3046,80.3%,1.130,3.52,3.78,2.60,3.00
Tanner Roark,SP,Nationals,,4393,543699,roarkta01,$16.62,,,,,,,,,,,,,,,,,,,,,31,198.67,798,178,16,138,,,,,,,39,1,6,64,63,15,10,,1951,,,2999,71.0%,1.092,2.85,2.90,3.42,3.98
Josh Harrison,2B/3B/LF/RF,Pirates,,3327,543281,harrijo05,$16.36,143,520,164,38,7,13,,77,52,18,7,22,1,4,2,2,.315,.345,.490,.363,,,,,,,,,,,,,,,,,,,,,,,,,,,,,,
Marcell Ozuna,CF/RF,Marlins,,4946,542303,ozunama01,$15.82,153,565,152,26,5,23,,72,85,3,1,41,1,1,5,,.269,.317,.455,.333,,,,,,,,,,,,,,,,,,,,,,,,,,,,,,
Jake Arrieta,SP,Cubs,,371,453562,arrieja01,$15.47,,,,,,,,,,,,,,,,,,,,,25,156.67,614,114,5,167,,,,,,,41,2,3,46,44,10,5,,1549,,,2415,68.9%,0.989,2.53,2.64,2.19,2.95
Tyson Ross,SP,Padres,,4773,475115,rossty01,$15.47,,,,,,,,,,,,,,,,,,,,,31,195.67,811,165,13,195,,,,,,,72,2,9,75,61,13,14,,1946,,,3118,67.7%,1.211,2.81,3.45,3.18,3.68
Sonny Gray,SP,Athletics,,5598,543243,grayso01,$15.33,,,,,,,,,,,,,,,,,,,,,33,219.00,899,187,15,183,,,,,,,74,2,7,84,75,14,10,,2066,,,3295,68.4%,1.192,3.08,3.45,3.40,4.01
Ben Revere,CF,Phillies,,1559,519184,reverbe01,$15.04,151,601,184,13,7,2,,71,28,49,8,13,1,4,1,7,.306,.321,.361,.318,,,,,,,,,,,,,,,,,,,,,,,,,,,,,,
Billy Hamilton,CF,Reds,,5264,571740,hamilbi02,$14.88,152,563,141,25,8,6,,72,48,56,23,34,,1,4,9,.250,.288,.355,.290,,,,,,,,,,,,,,,,,,,,,,,,,,,,,,
Christian Yelich,LF,Marlins,,5764,592885,yelicch01,$14.88,144,582,165,30,6,9,,94,54,21,7,70,3,3,2,3,.284,.361,.402,.342,,,,,,,,,,,,,,,,,,,,,,,,,,,,,,
Francisco Rodríguez,RP,Brewers,,2077,408061,rodrifr03,$14.55,,,,,,,,,,,,,,,,,,,,,69,68.00,265,49,14,73,,,,,,,18,1,1,23,23,5,5,44,667,,,1045,68.5%,0.985,3.04,3.04,4.42,2.90
Ryan Braun,LF/RF,Brewers,,3173,460075,braunry02,$14.24,135,530,141,30,6,19,,68,81,11,5,41,3,6,3,,.266,.324,.453,.335,,,,,,,,,,,,,,,,,,,,,,,,,,,,,,
Collin McHugh,RP/SP,Astros,,6145,543521,mchugco01,$13.74,,,,,,,,,,,,,,,,,,,,,25,154.67,619,117,13,157,,,,,,,41,1,6,53,47,11,9,,1596,,,2486,68.9%,1.022,2.73,3.08,3.05,3.24
Zack Britton,RP,Orioles,,5021,502154,brittza01,$12.96,,,,,,,,,,,,,,,,,,,,,71,76.33,285,46,4,62,,,,,,,23,,1,17,14,3,2,37,672,,,1053,68.2%,0.904,1.65,2.00,3.10,3.80
Matt Shoemaker,RP/SP,Angels,,5643,533167,shoemma01,$12.59,,,,,,,,,,,,,,,,,,,,,27,136.00,543,122,14,124,,,,,,,24,,4,49,46,16,4,,1348,,,2101,70.0%,1.074,3.04,3.24,3.23,3.28
Alex Wood,RP/SP,Braves,,6214,622072,woodal02,$12.39,,,,,,,,,,,,,,,,,,,,,35,171.67,694,151,16,170,,,,,,,45,1,6,58,53,11,11,,1743,,,2683,70.6%,1.142,2.78,3.04,3.20,3.32
Masahiro Tanaka,SP,Yankees,,6803,547888,,$12.29,,,,,,,,,,,,,,,,,,,,,20,136.33,542,123,15,141,,,,,,,21,,4,47,42,13,5,,1349,,,2009,73.3%,1.056,2.77,3.10,3.01,2.83
Kole Calhoun,RF,Angels,,5340,594777,calhoko01,$11.45,127,493,134,31,3,17,,90,58,5,3,38,,2,2,2,.272,.324,.450,.336,,,,,,,,,,,,,,,,,,,,,,,,,,,,,,
Dallas Keuchel,SP,Astros,,6127,572971,keuchda01,$10.90,,,,,,,,,,,,,,,,,,,,,29,200.00,808,187,11,146,,,,,,,48,2,7,71,65,12,9,,1928,,,3019,70.1%,1.175,2.92,3.19,3.15,4.02
Jason Heyward,CF/RF,Braves,,1885,518792,heywaja01,$10.36,149,573,155,26,3,11,,74,58,20,4,67,3,6,3,,.271,.351,.384,.333,,,,,,,,,,,,,,,,,,,,,,,,,,,,,,
Carlos Carrasco,RP/SP,Indians,,1015,471911,carraca01,$9.57,,,,,,,,,,,,,,,,,,,,,40,134.00,521,103,7,140,,,,,,,29,1,3,40,38,8,7,1,1327,,,1956,73.1%,0.985,2.55,2.69,2.38,2.88
Drew Stubbs,CF/RF,Rockies,,2857,453211,stubbdr01,$9.44,132,388,112,22,4,15,,67,43,20,3,30,1,1,3,2,.289,.337,.482,.362,,,,,,,,,,,,,,,,,,,,,,,,,,,,,,
Ian Kennedy,SP,Padres,,3599,453178,kenneia01,$9.08,,,,,,,,,,,,,,,,,,,,,33,201.00,846,189,16,207,,,,,,,70,4,4,85,81,13,13,,2198,,,3401,70.2%,1.289,3.63,3.81,3.12,3.45
Wily Peralta,SP,Brewers,,4993,503449,peralwi01,$9.02,,,,,,,,,,,,,,,,,,,,,32,198.67,838,198,23,154,,,,,,,61,,7,88,78,17,11,,1990,,,3192,68.5%,1.304,3.53,3.99,4.08,4.17
Wade Davis,RP/SP,Royals,,542,451584,daviswa01,$8.82,,,,,,,,,,,,,,,,,,,,,71,72.00,279,38,,109,,,,,,,23,,3,8,8,9,2,3,787,,,1210,68.2%,0.847,1.00,1.00,1.16,1.83
Edinson Vólquez,SP,Pirates,,2803,450172,volqued01,$8.75,,,,,,,,,,,,,,,,,,,,,32,192.67,809,166,17,140,,,,,,,71,6,14,75,65,13,7,,1901,,,2976,69.5%,1.230,3.04,3.50,4.02,4.49
Wei-Yin Chen,SP,Orioles,,5567,612672,chenwe02,$8.72,,,,,,,,,,,,,,,,,,,,,31,185.67,772,193,23,136,,,,,,,35,2,3,77,73,16,6,,1979,,,2977,73.0%,1.228,3.54,3.73,3.83,3.84
Lorenzo Cain,CF/RF,Royals,,3160,456715,cainlo01,$8.58,133,471,142,29,4,5,,55,53,28,5,24,2,4,3,,.301,.339,.412,.338,,,,,,,,,,,,,,,,,,,,,,,,,,,,,,
Dellin Betances,RP,Yankees,,5019,476454,betande01,$8.44,,,,,,,,,,,,,,,,,,,,,70,90.00,341,46,4,135,,,,,,,24,1,4,15,14,5,,1,891,,,1365,68.6%,0.778,1.40,1.50,1.58,1.59
Danny Santana,CF/SS,Twins,,5347,542454,,$8.33,101,405,129,27,7,7,,70,40,20,4,19,,3,1,2,.319,.351,.472,.366,,,,,,,,,,,,,,,,,,,,,,,,,,,,,,
Khris Davis,LF,Brewers,,5380,501981,daviskh01,$8.31,144,501,122,37,2,22,,70,69,4,1,32,,10,6,,.244,.299,.457,.325,,,,,,,,,,,,,,,,,,,,,,,,,,,,,,
Alfredo Simon,RP/SP,Reds,,412,430580,simonal01,$8.30,,,,,,,,,,,,,,,,,,,,,32,196.33,819,181,22,127,,,,,,,56,7,12,80,75,15,10,,1945,,,3014,70.5%,1.207,3.44,3.67,4.20,4.42
Yordano Ventura,SP,Royals,,6225,570649,ventuyo01,$8.28,,,,,,,,,,,,,,,,,,,,,31,183.00,782,168,14,159,,,,,,,69,1,5,70,65,14,10,,1890,,,2985,68.9%,1.295,3.20,3.44,3.55,4.08
Ryan Howard,1B,Phillies,,2318,429667,howarry01,$8.21,153,569,127,18,1,23,,65,95,,,67,7,7,5,,.223,.310,.380,.302,,,,,,,,,,,,,,,,,,,,,,,,,,,,,,
Joe Smith,RP,Angels,,1006,501925,smithjo05,$8.03,,,,,,,,,,,,,,,,,,,,,76,74.67,284,45,4,68,,,,,,,15,3,6,16,15,7,2,15,741,,,1104,71.2%,0.804,1.81,1.93,2.70,3.26
Jake McGee,RP,Rays,,530,459429,mcgeeja01,$7.85,,,,,,,,,,,,,,,,,,,,,73,71.33,274,48,2,90,,,,,,,16,1,2,15,15,5,2,19,764,,,1151,70.5%,0.897,1.89,1.89,1.66,2.19
Trevor Rosenthal,RP,Cardinals,,5619,572096,rosentr01,$7.78,,,,,,,,,,,,,,,,,,,,,72,70.33,308,57,2,87,,,,,,,42,5,4,25,25,2,6,45,800,,,1263,67.9%,1.408,3.20,3.20,2.74,3.58
Dioner Navarro,C/DH,Blue Jays,,562,425900,navardi01,$7.44,139,481,132,22,,12,,40,69,3,,32,1,1,6,,.274,.317,.395,.314,,,,,,,,,,,,,,,,,,,,,,,,,,,,,,
Starlin Castro,SS,Cubs,,2675,516770,castrst01,$7.42,134,528,154,33,1,14,,58,65,4,4,35,4,4,2,,.292,.339,.438,.336,,,,,,,,,,,,,,,,,,,,,,,,,,,,,,
Bud Norris,SP,Orioles,,2946,502032,norribu01,$7.40,,,,,,,,,,,,,,,,,,,,,28,165.33,687,149,20,139,,,,,,,52,2,14,68,67,15,8,,1756,,,2746,69.4%,1.216,3.65,3.70,4.15,4.09
Jason Hammel,SP,Athletics,,3768,434628,hammeja01,$7.38,,,,,,,,,,,,,,,,,,,,,30,176.33,715,154,23,158,,,,,,,44,2,8,70,68,10,11,,1782,,,2796,69.2%,1.123,3.47,3.57,3.85,3.58
Matt Adams,1B,Cardinals,,5355,571431,adamsma01,$7.15,142,527,152,34,5,15,,55,68,3,2,26,5,3,7,,.288,.321,.457,.332,,,,,,,,,,,,,,,,,,,,,,,,,,,,,,
Henderson Alvarez III,SP,Marlins,,5102,506693,alvarhe01,$7.09,,,,,,,,,,,,,,,,,,,,,30,187.00,772,198,14,111,,,,,,,33,3,8,65,55,12,7,,1742,,,2611,74.3%,1.235,2.65,3.13,3.50,4.26
Trevor Plouffe,3B,Twins,,1546,461858,plouftr01,$6.94,136,520,134,40,2,14,,69,80,2,1,53,2,4,5,,.258,.328,.423,.327,,,,,,,,,,,,,,,,,,,,,,,,,,,,,,
Jacob deGrom,SP,Mets,,9396,594798,,$6.80,,,,,,,,,,,,,,,,,,,,,22,140.33,565,117,7,144,,,,,,,43,2,1,44,42,9,6,,1473,,,2236,71.1%,1.140,2.69,2.82,2.59,3.23
Nolan Arenado,3B,Rockies,,5217,571448,arenano01,$6.69,111,432,124,34,2,18,,58,61,2,1,25,1,4,5,1,.287,.328,.500,.353,,,,,,,,,,,,,,,,,,,,,,,,,,,,,,
Danny Duffy,SP,Royals,,5078,518633,duffyda01,$6.12,,,,,,,,,,,,,,,,,,,,,31,149.33,606,113,12,113,,,,,,,53,2,5,52,42,9,12,,1545,,,2429,68.3%,1.112,2.53,3.13,3.76,4.27
Curtis Granderson,CF/RF,Mets,,321,434158,grandcu01,$5.85,155,564,128,27,2,20,,73,66,8,2,79,1,6,5,,.227,.326,.388,.318,,,,,,,,,,,,,,,,,,,,,,,,,,,,,,
Hector Rondón,RP,Cubs,,1001,444468,rondohe01,$5.57,,,,,,,,,,,,,,,,,,,,,64,63.33,251,52,2,63,,,,,,,15,,,21,17,4,4,29,668,,,998,72.1%,1.058,2.42,2.98,2.23,3.11
Steve Pearce,1B/DH/LF,Orioles,,3304,456665,pearcst01,$5.44,102,338,99,26,,21,,51,49,5,,40,1,4,1,,.293,.373,.556,.400,,,,,,,,,,,,,,,,,,,,,,,,,,,,,,
Josh Collmenter,RP/SP,Diamondbacks,,5003,518567,collmjo01,$5.35,,,,,,,,,,,,,,,,,,,,,33,179.33,719,163,18,115,,,,,,,39,2,4,75,69,11,9,1,1763,,,2719,70.8%,1.126,3.46,3.76,3.81,4.16
Sean Doolittle,RP,Athletics,,4821,448281,doolise01,$5.02,,,,,,,,,,,,,,,,,,,,,61,62.67,235,38,5,89,,,,,,,8,1,,19,19,2,4,22,681,,,928,77.5%,0.734,2.73,2.73,1.63,1.19
Aramis Ramirez,3B,Brewers,,2670,133380,ramirar01,$4.46,133,494,141,23,1,15,,47,66,3,,21,2,13,3,,.285,.330,.427,.331,,,,,,,,,,,,,,,,,,,,,,,,,,,,,,
Zack Wheeler,SP,Mets,,5491,554430,wheelza01,$4.45,,,,,,,,,,,,,,,,,,,,,32,185.33,794,167,14,187,,,,,,,79,3,11,84,73,11,11,,2028,,,3308,66.4%,1.327,3.54,4.08,3.47,3.88
Tony Watson,RP,Pirates,,4997,453265,watsoto01,$4.15,,,,,,,,,,,,,,,,,,,,,78,77.33,302,64,5,81,,,,,,,15,,6,16,14,10,2,2,804,,,1199,72.4%,1.022,1.63,1.86,2.66,3.02
Lonnie Chisenhall,3B,Indians,,1070,502082,chiselo01,$4.12,142,478,134,29,1,13,,62,59,3,1,39,3,8,3,4,.280,.340,.427,.337,,,,,,,,,,,,,,,,,,,,,,,,,,,,,,
Casey McGehee,3B,Marlins,,3148,431171,mcgehca01,$3.62,160,616,177,29,1,4,,56,76,4,2,67,3,1,7,,.287,.355,.357,.320,,,,,,,,,,,,,,,,,,,,,,,,,,,,,,
Miguel Montero,C,Diamondbacks,,3636,471083,montemi01,$3.42,136,489,119,23,,13,,40,72,,4,56,11,9,6,,.243,.329,.370,.301,,,,,,,,,,,,,,,,,,,,,,,,,,,,,,
Derek Norris,C,Athletics,,2481,519083,norride01,$3.41,127,385,104,19,1,10,,46,55,2,2,54,2,1,1,1,.270,.360,.403,.338,,,,,,,,,,,,,,,,,,,,,,,,,,,,,,
Dustin Ackley,2B/CF/LF,Mariners,,4296,554429,ackledu01,$3.38,143,502,123,27,4,14,,64,65,8,4,32,1,3,2,3,.245,.292,.398,.301,,,,,,,,,,,,,,,,,,,,,,,,,,,,,,
Mike Zunino,C,Mariners,,6238,572287,zuninmi01,$3.19,131,438,87,20,2,22,,51,60,,3,17,1,17,4,,.199,.254,.404,.279,,,,,,,,,,,,,,,,,,,,,,,,,,,,,,
Pat Neshek,RP,Cardinals,,1487,450212,neshepa01,$2.78,,,,,,,,,,,,,,,,,,,,,71,67.33,255,44,4,68,,,,,,,9,2,2,14,14,7,2,6,713,,,985,76.9%,0.787,1.87,1.87,2.25,2.60
Jenrry Mejia,RP/SP,Mets,,2093,516769,mejiaje01,$2.33,,,,,,,,,,,,,,,,,,,,,63,93.67,417,98,9,98,,,,,,,41,8,4,41,38,6,6,28,1004,,,1550,71.1%,1.484,3.65,3.94,3.44,3.61
Adam Eaton,CF/LF,White Sox,,5316,594809,eatonad02,$2.32,123,486,146,26,10,1,,76,35,15,9,43,,5,2,2,.300,.361,.401,.339,,,,,,,,,,,,,,,,,,,,,,,,,,,,,,
Michael Morse,1B/LF/RF,Giants,,2494,434604,morsemi01,$1.88,131,438,122,32,3,16,,48,61,,,31,,9,4,,.279,.336,.475,.350,,,,,,,,,,,,,,,,,,,,,,,,,,,,,,
Jake Odorizzi,SP,Rays,,3107,543606,odorija01,$1.79,,,,,,,,,,,,,,,,,,,,,31,168.00,719,156,20,174,,,,,,,59,,5,79,77,11,13,,1933,,,3028,69.0%,1.280,4.12,4.23,3.72,3.56
Marcus Stroman,RP/SP,Blue Jays,,6503,573186,,$1.68,,,,,,,,,,,,,,,,,,,,,26,130.67,534,125,7,111,,,,,,,28,1,3,56,53,11,6,1,1345,,,2082,70.6%,1.171,3.65,3.86,2.79,3.58
Dayan Viciedo,CF/LF/RF,White Sox,,4959,493364,vicieda01,$1.33,145,523,121,22,3,21,,65,58,,1,32,3,5,3,,.231,.281,.405,.295,,,,,,,,,,,,,,,,,,,,,,,,,,,,,,
Scooter Gennett,2B,Brewers,,5230,571697,gennesc01,$1.26,137,440,127,31,3,9,,55,54,6,3,22,5,,4,8,.289,.314,.434,.323,,,,,,,,,,,,,,,,,,,,,,,,,,,,,,
Chris Young,SP,Mariners,,3937,432934,youngch03,$1.06,,,,,,,,,,,,,,,,,,,,,30,165.00,688,143,26,108,,,,,,,60,3,3,70,67,12,9,,1731,,,2718,68.9%,1.230,3.65,3.82,4.93,4.56
Santiago Casilla,RP,Giants,,4062,433586,garcija01,$1.05,,,,,,,,,,,,,,,,,,,,,54,58.33,218,35,3,45,,,,,,,15,2,3,13,11,3,3,19,544,,,860,67.3%,0.857,1.70,2.01,3.05,3.79
Luis Valbuena,2B/3B,Cubs,,1067,472528,valbulu01,$1.00,149,478,119,33,4,16,,68,51,1,2,65,4,2,1,1,.249,.340,.435,.337,,,,,,,,,,,,,,,,,,,,,,,,,,,,,,
Kolten Wong,2B,Cardinals,,5622,543939,wongko01,$1.00,113,402,100,14,3,12,,52,42,20,4,21,3,4,1,5,.249,.289,.388,.303,,,,,,,,,,,,,,,,,,,,,,,,,,,,,,
Mark Teixeira,1B,Yankees,,285,407893,teixema01,$1.00,123,440,95,14,,22,,56,62,1,1,58,3,6,4,,.216,.313,.398,.311,,,,,,,,,,,,,,,,,,,,,,,,,,,,,,
Brandon Crawford,SS,Giants,,4142,543063,crawfbr01,$1.00,153,491,121,20,10,10,,54,69,5,3,59,10,2,10,2,.246,.323,.389,.307,,,,,,,,,,,,,,,,,,,,,,,,,,,,,,
Nick Castellanos,3B,Tigers,,5597,592206,casteni01,$1.00,148,533,138,31,4,11,,50,66,2,2,36,3,3,7,,.259,.306,.394,.303,,,,,,,,,,,,,,,,,,,,,,,,,,,,,,
Justin Turner,3B/SS,Dodgers,,446,457759,turneju01,$1.00,109,288,98,21,1,7,,46,43,6,1,28,1,4,2,,.340,.404,.493,.395,,,,,,,,,,,,,,,,,,,,,,,,,,,,,,
Jordy Mercer,2B/SS,Pirates,,3345,474568,mercejo03,$1.00,149,506,129,27,2,12,,56,55,4,1,35,12,4,5,5,.255,.303,.387,.297,,,,,,,,,,,,,,,,,,,,,,,,,,,,,,
George Springer,CF/RF,Astros,,5594,543807,,$1.00,78,295,68,8,1,20,,45,51,5,2,39,4,9,2,,.231,.336,.468,.345,,,,,,,,,,,,,,,,,,,,,,,,,,,,,,
Oswaldo Arcia,LF/RF,Twins,,5532,542455,arciaos01,$1.00,103,372,86,16,3,20,,46,57,1,2,31,4,6,1,,.231,.300,.452,.319,,,,,,,,,,,,,,,,,,,,,,,,,,,,,,
Yasmani Grandal,1B/C,Padres,,4985,518735,grandya01,$1.00,128,377,85,19,1,15,,47,49,3,,58,1,2,6,,.225,.327,.401,.322,,,,,,,,,,,,,,,,,,,,,,,,,,,,,,
Tyler Flowers,C,White Sox,,4971,452095,flowety01,$1.00,127,407,98,16,1,15,,42,50,,1,25,,8,1,1,.241,.296,.396,.303,,,,,,,,,,,,,,,,,,,,,,,,,,,,,,
Kurt Suzuki,C,Twins,,4816,435559,suzukku01,$1.00,131,452,130,34,,3,,37,61,,1,34,,9,7,1,.288,.344,.383,.322,,,,,,,,,,,,,,,,,,,,,,,,,,,,,,
Travis d'Arnaud,C,Mets,,723,518595,darnatr01,$1.00,108,385,93,22,3,13,,48,41,1,,32,5,2,1,1,.242,.302,.416,.309,,,,,,,,,,,,,,,,,,,,,,,,,,,,,,
Brandon McCarthy,SP,Yankees,,4437,435221,mccarbr01,$1.00,,,,,,,,,,,,,,,,,,,,,32,200.00,836,222,25,175,,,,,,,33,4,3,100,90,10,15,,2104,,,3044,76.4%,1.275,4.05,4.50,3.46,3.34
Drew Hutchison,SP,Blue Jays,,5395,571800,hutchdr01,$1.00,,,,,,,,,,,,,,,,,,,,,32,184.67,785,173,23,184,,,,,,,60,1,7,92,92,11,13,,1950,,,3049,69.6%,1.262,4.48,4.48,3.80,3.59
Jon Niese,SP,Mets,,2094,477003,niesejo01,$1.00,,,,,,,,,,,,,,,,,,,,,30,187.67,786,193,17,138,,,,,,,45,,7,80,71,9,11,,1823,,,2792,72.2%,1.268,3.40,3.84,3.64,4.09
Aaron Harang,SP,Braves,,2792,421685,haranaa01,$1.00,,,,,,,,,,,,,,,,,,,,,33,204.33,876,215,15,161,,,,,,,71,4,1,88,81,12,12,,2178,,,3394,70.5%,1.400,3.57,3.88,3.48,4.12
Jason Vargas,SP,Royals,,4210,450306,vargaja01,$1.00,,,,,,,,,,,,,,,,,,,,,30,187.00,790,197,19,128,,,,,,,41,4,6,82,77,11,10,,1919,,,3003,70.5%,1.273,3.71,3.95,3.74,4.10
John Jaso,C/DH,Athletics,,4900,444379,jasojo01,$1.00,99,307,81,18,3,9,,42,40,2,,28,1,7,2,,.264,.337,.430,.337,,,,,,,,,,,,,,,,,,,,,,,,,,,,,,
Andrew Miller,RP,Orioles,,1952,453192,millean01,$1.00,,,,,,,,,,,,,,,,,,,,,73,62.33,242,33,3,103,,,,,,,17,2,5,16,14,5,5,1,644,,,992,68.2%,0.802,2.02,2.31,1.38,1.25
Tom Koehler,SP,Marlins,,5106,543408,koehlto01,$1.00,,,,,,,,,,,,,,,,,,,,,32,191.33,803,177,16,153,,,,,,,71,,7,84,81,10,10,,1850,,,2941,68.9%,1.296,3.81,3.95,3.81,4.28
Brad Boxberger,RP,Rays,,5420,502202,boxbebr01,$1.00,,,,,,,,,,,,,,,,,,,,,63,64.67,247,34,9,104,,,,,,,20,,4,17,17,5,2,2,721,,,1056,71.5%,0.835,2.37,2.37,2.81,1.51
Tim Hudson,SP,Giants,,1810,218596,hudsoti01,$1.00,,,,,,,,,,,,,,,,,,,,,31,189.33,789,199,15,120,,,,,,,34,3,7,86,75,9,13,,1836,,,2784,73.1%,1.231,3.57,4.09,3.46,4.15
Darren O'Day,RP,Orioles,,4416,503285,odayda01,$1.00,,,,,,,,,,,,,,,,,,,,,68,68.67,271,42,6,73,,,,,,,19,4,8,14,13,5,2,4,712,,,1067,70.7%,0.888,1.70,1.83,3.11,3.15
Yusmeiro Petit,RP,Giants,,4267,433589,petityu01,$1.00,,,,,,,,,,,,,,,,,,,,,39,117.00,461,97,12,133,,,,,,,22,5,1,51,48,5,5,,1143,,,1677,73.9%,1.017,3.69,3.92,2.62,2.37
Jarred Cosart,SP,Marlins,,5837,543054,cosarja01,$1.00,,,,,,,,,,,,,,,,,,,,,30,180.33,766,173,9,115,,,,,,,73,1,3,80,74,13,11,,1828,,,2946,67.9%,1.364,3.69,3.99,3.72,4.77
Roenis Elías,SP,Mariners,,7079,606273,,$1.00,,,,,,,,,,,,,,,,,,,,,29,163.67,693,151,16,143,,,,,,,64,3,11,77,70,10,12,,1647,,,2661,67.6%,1.314,3.85,4.23,3.94,4.17
Mike Fiers,SP,Brewers,,3097,571666,fiersmi01,$1.00,,,,,,,,,,,,,,,,,,,,,14,71.67,274,46,7,76,,,,,,,17,1,,19,17,6,5,,727,,,1122,68.9%,0.879,2.13,2.39,2.92,2.76
Josh Beckett,SP,Dodgers,,64,277417,beckejo02,$-0.11,,,,,,,,,,,,,,,,,,,,,20,115.67,475,96,17,107,,,,,,,39,2,5,41,37,6,6,,1191,,,1908,67.5%,1.167,2.88,3.19,4.25,3.75
Michael Pineda,SP,Yankees,,4268,501381,pinedmi01,$-0.30,,,,,,,,,,,,,,,,,,,,,13,76.33,290,56,5,59,,,,,,,7,,,18,16,5,5,,808,,,1140,75.8%,0.825,1.89,2.12,2.68,3.25
Josh Reddick,RF,Athletics,,170,502210,reddijo01,$-0.41,109,363,96,16,7,12,,53,54,1,1,28,,1,3,,.264,.316,.446,.329,,,,,,,,,,,,,,,,,,,,,,,,,,,,,,
Ryan Vogelsong,SP,Giants,,2299,285064,vogelry01,$-0.86,,,,,,,,,,,,,,,,,,,,,32,184.67,780,178,18,151,,,,,,,58,2,9,86,82,8,13,,1912,,,3058,68.3%,1.278,4.00,4.19,3.79,4.07
Chris Coghlan,LF,Cubs,,2009,458085,coghlch01,$-1.12,125,385,109,28,5,9,,50,41,7,4,39,2,3,2,3,.283,.350,.452,.349,,,,,,,,,,,,,,,,,,,,,,,,,,,,,,
Angel Pagan,CF,Giants,,2180,434636,paganan01,$-1.19,96,383,115,21,2,3,,56,27,16,6,25,1,1,3,1,.300,.341,.389,.326,,,,,,,,,,,,,,,,,,,,,,,,,,,,,,
Vance Worley,SP,Pirates,,4964,474699,worleva01,$-1.22,,,,,,,,,,,,,,,,,,,,,18,110.67,458,112,9,79,,,,,,,22,1,3,43,35,8,4,,1072,,,1580,74.9%,1.211,2.85,3.50,3.38,3.96
Chris Iannetta,C,Angels,,3783,455104,iannech01,$-1.39,108,306,77,22,,7,,41,43,3,,54,3,8,5,,.252,.373,.392,.343,,,,,,,,,,,,,,,,,,,,,,,,,,,,,,
J.A. Happ,SP,Blue Jays,,2286,457918,happja01,$-1.46,,,,,,,,,,,,,,,,,,,,,30,158.00,673,160,22,133,,,,,,,51,,2,79,74,11,11,,1741,,,2710,70.1%,1.335,4.22,4.50,4.23,3.97
Juan Lagares,CF,Mets,,2190,501571,lagarju01,$-1.49,116,416,117,24,3,4,,46,47,13,4,20,1,7,6,3,.281,.319,.382,.312,,,,,,,,,,,,,,,,,,,,,,,,,,,,,,
Juan Uribe,3B,Dodgers,,4132,346874,uribeju01,$-1.64,103,386,120,23,,9,,36,54,,1,15,2,1,2,,.311,.337,.440,.336,,,,,,,,,,,,,,,,,,,,,,,,,,,,,,
Robinson Chirinos,C,Rangers,,2632,455139,chiriro01,$-1.71,93,306,73,15,,13,,36,40,,1,17,1,7,4,4,.239,.287,.415,.303,,,,,,,,,,,,,,,,,,,,,,,,,,,,,,
Conor Gillaspie,3B,White Sox,,4135,543216,gillaco01,$-1.84,130,464,131,31,5,7,,50,57,,4,36,4,3,3,,.282,.336,.416,.324,,,,,,,,,,,,,,,,,,,,,,,,,,,,,,
DJ LeMahieu,2B,Rockies,,2658,518934,lemahdj01,$-2.17,149,494,132,15,5,5,,59,42,10,10,33,7,2,2,7,.267,.310,.348,.287,,,,,,,,,,,,,,,,,,,,,,,,,,,,,,
LaTroy Hawkins,RP,Rockies,,3074,115629,hawkila01,$-2.23,,,,,,,,,,,,,,,,,,,,,57,54.33,226,52,3,32,,,,,,,13,2,,23,20,4,3,23,559,,,828,73.8%,1.196,3.31,3.81,3.25,4.28
Melvin Upton,CF,Braves,,603,425834,uptonbj01,$-2.24,141,519,108,19,5,12,,67,35,20,7,57,5,1,2,3,.208,.285,.333,.277,,,,,,,,,,,,,,,,,,,,,,,,,,,,,,
Dan Otero,RP,Athletics,,4048,519096,oteroda01,$-2.25,,,,,,,,,,,,,,,,,,,,,72,86.67,349,80,4,45,,,,,,,15,7,2,24,22,8,2,1,821,,,1216,74.1%,1.096,2.28,2.49,3.01,4.17
David Freese,3B,Angels,,3514,501896,freesda01,$-2.43,134,462,120,25,1,10,,53,55,1,3,38,,6,5,,.260,.321,.383,.309,,,,,,,,,,,,,,,,,,,,,,,,,,,,,,
Alex Avila,C,Tigers,,1191,488671,avilaal01,$-2.45,124,390,85,22,,11,,44,47,,3,61,1,3,2,1,.218,.326,.359,.305,,,,,,,,,,,,,,,,,,,,,,,,,,,,,,
Carlos Torres,RP,Mets,,872,448614,torreca01,$-2.47,,,,,,,,,,,,,,,,,,,,,73,97.00,405,89,11,96,,,,,,,38,4,2,35,33,8,6,2,991,,,1576,68.5%,1.309,3.06,3.25,3.71,3.60
Aaron Hill,2B,Diamondbacks,,743,431094,hillaa01,$-2.52,133,501,122,26,3,10,,52,60,4,3,28,,5,7,,.244,.287,.367,.286,,,,,,,,,,,,,,,,,,,,,,,,,,,,,,
Kyle Gibson,SP,Twins,,5084,502043,gibsoky01,$-2.61,,,,,,,,,,,,,,,,,,,,,31,179.33,757,178,12,107,,,,,,,57,,2,91,89,13,12,,1714,,,2800,67.6%,1.310,4.47,4.57,3.76,4.64
Welington Castillo,C,Cubs,,2631,456078,castiwe01,$-2.63,110,380,90,19,,13,,28,46,,,26,,7,2,2,.237,.295,.389,.301,,,,,,,,,,,,,,,,,,,,,,,,,,,,,,
René Rivera,C,Padres,,2119,425784,riverre01,$-2.74,103,294,74,18,1,11,,27,44,,,27,3,3,2,3,.252,.316,.432,.324,,,,,,,,,,,,,,,,,,,,,,,,,,,,,,
Jean Machi,RP,Giants,,3249,466948,machije01,$-2.82,,,,,,,,,,,,,,,,,,,,,71,66.33,249,45,5,51,,,,,,,18,3,1,19,19,7,1,2,590,,,927,68.5%,0.950,2.58,2.58,3.27,3.69
Mike Dunn,RP,Marlins,,1779,445197,dunnmi01,$-3.02,,,,,,,,,,,,,,,,,,,,,75,57.00,245,47,4,67,,,,,,,22,1,4,25,20,10,6,1,638,,,988,69.3%,1.211,3.16,3.95,2.98,3.33
Drew Storen,RP,Nationals,,2466,519322,storedr01,$-3.06,,,,,,,,,,,,,,,,,,,,,65,56.33,224,44,2,46,,,,,,,11,3,3,8,7,2,1,11,546,,,807,73.1%,0.976,1.12,1.28,2.51,3.50
Garrett Jones,1B/RF,Marlins,,3397,434540,jonesga02,$-3.13,146,496,122,33,2,15,,59,53,,1,46,4,1,4,,.246,.309,.411,.311,,,,,,,,,,,,,,,,,,,,,,,,,,,,,,
Jesse Chavez,RP/SP,Athletics,,1776,445926,chaveje01,$-3.14,,,,,,,,,,,,,,,,,,,,,32,146.00,621,142,17,136,,,,,,,49,3,5,64,56,8,8,,1575,,,2400,71.5%,1.308,3.45,3.95,3.80,3.75
Charlie Morton,SP,Pirates,,3278,450203,mortoch02,$-3.42,,,,,,,,,,,,,,,,,,,,,26,157.33,666,143,9,126,,,,,,,57,2,19,76,65,6,12,,1584,,,2504,69.0%,1.271,3.72,4.35,3.65,4.46
Kyle Hendricks,SP,Cubs,,6096,543294,,$-3.50,,,,,,,,,,,,,,,,,,,,,13,80.33,321,72,4,47,,,,,,,15,2,4,24,22,7,2,,757,,,1156,71.7%,1.083,2.46,2.69,3.21,4.27
Carlos Ruiz,C,Phillies,,2310,434563,ruizca01,$-3.60,110,381,96,25,1,6,,43,31,4,2,46,1,12,5,1,.252,.346,.370,.321,,,,,,,,,,,,,,,,,,,,,,,,,,,,,,
Seth Smith,DH/LF/RF,Padres,,3845,452234,smithse01,$-3.67,136,443,118,31,5,12,,55,48,1,1,69,3,4,4,,.266,.367,.440,.353,,,,,,,,,,,,,,,,,,,,,,,,,,,,,,
Brock Holt,2B/3B/RF,Red Sox,,3344,571788,holtbr01,$-3.71,106,449,126,23,5,4,,68,29,12,2,33,,2,3,5,.281,.327,.381,.320,,,,,,,,,,,,,,,,,,,,,,,,,,,,,,
Jarrod Dyson,CF,Royals,,1417,502481,dysonja01,$-4.09,120,260,70,4,4,1,,33,24,36,7,22,,,2,6,.269,.317,.327,.314,,,,,,,,,,,,,,,,,,,,,,,,,,,,,,
Joakim Soria,RP,Tigers,,1341,465657,soriajo01,$-4.10,,,,,,,,,,,,,,,,,,,,,48,44.33,182,38,2,48,,,,,,,6,2,2,19,16,2,4,18,462,,,692,72.3%,0.992,3.25,3.86,1.93,2.60
Xander Bogaerts,3B/SS,Red Sox,,6301,593428,bogaexa01,$-4.15,144,538,129,28,1,12,,60,46,2,3,39,1,8,7,2,.240,.296,.362,.289,,,,,,,,,,,,,,,,,,,,,,,,,,,,,,
Michael Wacha,SP,Cardinals,,6262,608379,wachami01,$-4.24,,,,,,,,,,,,,,,,,,,,,19,107.00,447,95,6,94,,,,,,,33,,5,41,38,5,6,,1126,,,1694,72.1%,1.196,3.20,3.45,3.14,3.90
AJ Ramos,RP,Marlins,,4917,573109,ramosaj01,$-4.28,,,,,,,,,,,,,,,,,,,,,68,64.00,270,36,1,73,,,,,,,43,7,3,16,15,7,,,668,,,1097,64.2%,1.234,2.11,2.25,2.85,3.85
David Murphy,LF/RF,Indians,,4505,461815,murphda07,$-4.28,129,416,109,25,1,8,,40,58,2,3,36,2,2,7,1,.262,.318,.385,.306,,,,,,,,,,,,,,,,,,,,,,,,,,,,,,