Player,Position,ProTeam,RotoTeam,RVid,MLBAMID,BDBID,RotoValue,bG,bAB,bH,bHR,bR,bRBI,bSB,bAvg,pG,pIP,pH,pK,pBB,pER,pWin,pSav,pWHIP,pERA
Javier Báez,SS,Cubs,,6040,595879,,$-0.00,138,502,133,31,80,87,18,.265,,,,,,,,,,
Ian Happ,CF,Cubs,,11673,664023,,$-0.00,148,465,105,25,63,66,9,.226,,,,,,,,,,
Patrick Wisdom,None,Cubs,,6548,621550,,$-0.00,106,338,78,28,54,61,4,.231,,,,,,,,,,
Willson Contreras,C,Cubs,,6038,575929,,$-0.00,128,413,98,21,61,57,5,.237,,,,,,,,,,
Joc Pederson,LF,Cubs,,5344,592626,,$-0.00,137,429,102,18,55,61,2,.238,,,,,,,,,,
Frank Schwindel,1B,Cubs,,11162,643524,,$-0.00,64,242,79,14,44,43,2,.326,,,,,,,,,,
Rafael Ortega,CF,Cubs,,6151,542364,ortegra01,$-0.00,103,296,86,11,44,33,12,.291,,,,,,,,,,
Matt Duffy,3B,Cubs,,10023,622110,,$-0.00,97,289,83,5,45,30,8,.287,1,0.33,,,,,,,,
Kyle Hendricks,SP,Cubs,,6096,543294,,$-0.00,30,52,6,,3,1,,.115,32,181.00,200,131,44,96,14,,1.348,4.77
Adbert Alzolay,SP,Cubs,,11928,640470,,$-0.00,28,31,2,,1,,,.065,29,125.67,112,128,34,64,5,1,1.162,4.58
Jason Heyward,RF,Cubs,,1885,518792,heywaja01,$-0.00,104,323,69,8,35,30,5,.214,,,,,,,,,,
Codi Heuer,RP,Cubs,,13193,676051,,$-0.00,24,,,,,,,,65,67.33,65,56,23,32,7,2,1.307,4.28
David Bote,None,Cubs,,11674,623520,,$-0.00,97,291,58,8,32,35,,.199,,,,,,,,,,
Jake Marisnick,CF,Cubs,,5210,545350,marisja01,$-0.00,99,176,38,5,21,24,4,.216,,,,,,,,,,
Sergio Alcántara,SS,Cubs,,10868,642727,,$-0.00,89,220,45,5,30,17,3,.205,1,0.33,,,,,,,,
Nico Hoerner,2B,Cubs,,12640,663538,,$-0.00,44,149,45,,13,16,5,.302,,,,,,,,,,
Justin Steele,SP,Cubs,,12357,657006,,$-0.00,17,13,2,,3,,,.154,20,57.00,50,59,27,27,4,,1.351,4.26
Trevor Williams,SP,Cubs,,10571,592866,,$-0.00,21,25,5,,1,1,,.200,23,91.00,105,90,31,44,4,,1.495,4.35
Keegan Thompson,SP,Cubs,,13543,624522,,$-0.00,29,6,1,,,,,.167,32,53.33,48,55,31,20,3,1,1.481,3.38
Rex Brothers,RP,Cubs,,5144,571521,brothre01,$-0.00,54,2,,,,,,,57,53.00,41,75,35,31,3,1,1.434,5.26
Alec Mills,SP,Cubs,,11286,621219,,$-0.00,31,32,1,,1,,,.031,32,119.00,137,87,34,67,6,1,1.437,5.07
Robinson Chirinos,C,Cubs,,2632,455139,chiriro01,$-0.00,45,97,22,5,13,15,,.227,,,,,,,,,,
Eric Sogard,3B,Cubs,,4832,519299,sogarer01,$-0.00,78,169,42,1,16,12,3,.249,5,4.33,7,1,,3,,,1.615,6.23
Dillon Maples,RP,Cubs,,11870,596027,,$-0.00,28,,,,,,,,28,31.33,15,40,25,9,1,,1.277,2.59
Adrian Sampson,SP,Cubs,,10460,592716,,$-0.00,10,7,,,,,,,10,35.33,30,28,8,11,1,,1.075,2.80
Adam Morgan,RP,Cubs,,6251,605388,,$-0.00,32,,,,,,,,34,25.33,22,28,12,12,2,2,1.342,4.26
Trayce Thompson,CF,Cubs,,932,572204,,$-0.00,15,28,7,4,6,9,2,.250,,,,,,,,,,
Brad Wieck,RP,Cubs,,11634,623364,,$-0.00,14,,,,,,,,15,17.00,10,28,10,,,,1.176,
Rowan Wick,RP,Cubs,,11045,592858,,$-0.00,20,,,,,,,,22,23.00,17,29,14,11,,5,1.348,4.30
Scott Effross,RP,Cubs,,13353,664123,,$-0.00,13,,,,,1,,,14,14.67,13,18,1,6,2,,0.955,3.68
Alfonso Rivas,1B,Cubs,,12707,,,$-0.00,18,44,14,1,7,3,,.318,,,,,,,,,,
Michael Hermosillo,CF,Cubs,,11619,641684,,$-0.00,16,36,7,3,5,7,,.194,,,,,,,,,,
Manuel Rodríguez,RP,Cubs,,13032,655889,,$-0.00,17,1,,,,,,,20,17.67,18,16,12,12,3,1,1.698,6.11
Johneshwy Fargas,CF,Cubs,,11413,,,$-0.00,22,52,13,,4,5,1,.250,,,,,,,,,,
Joe Biagini,RP,Cubs,,11280,607352,,$-0.00,1,,,,,,,,1,3.00,2,2,1,,1,,1.000,
Jason Adam,RP,Cubs,,7279,592094,,$-0.00,12,,,,,,,,12,10.67,10,19,6,7,1,,1.500,5.91
Austin Romine,C,Cubs,,281,519222,rominau01,$-0.00,28,60,13,1,5,5,,.217,,,,,,,,,,
Zach Davies,SP,Cubs,,10824,605200,,$-0.00,31,34,6,,2,2,,.176,32,148.00,162,114,75,95,6,,1.601,5.78
Nick Martini,LF,Cubs,,12097,605361,,$-0.00,25,37,10,,4,4,,.270,,,,,,,,,,
Dan Winkler,RP,Cubs,,9729,595465,,$-0.00,45,1,,,,,,,47,39.67,32,40,30,23,1,,1.563,5.22
Andrew Romine,None,Cubs,,1699,461865,rominan01,$-0.00,26,60,11,1,7,5,,.183,1,1.00,2,1,,1,,,2.000,9.00
Pedro Strop,RP,Cubs,,4425,467008,stroppe01,$-0.00,2,,,,,,,,2,2.00,2,3,2,,1,,2.000,
Kohl Stewart,SP,Cubs,,7455,640464,,$-0.00,4,3,1,,,,,.333,4,13.67,17,11,6,8,1,,1.683,5.27
Tommy Nance,SP,Cubs,,13217,,,$-0.00,27,2,,,,,,,27,28.67,25,30,13,23,1,,1.326,7.22
Erick Castillo,C,Cubs,,10995,602080,,$-0.00,4,8,2,,,,,.250,,,,,,,,,,
Miguel Amaya,C,Cubs,,12714,665804,,$-0.00,,,,,,,,,,,,,,,,,,
James Bourque,None,Cubs,,12371,630263,,$-0.00,,,,,,,,,,,,,,,,,,
Alexander Canario,RF,Cubs,,13186,672744,,$-0.00,,,,,,,,,,,,,,,,,,
Anderson Espinoza,SP,Cubs,,12333,,,$-0.00,,,,,,,,,,,,,,,,,,
Trevor Kelley,RP,Cubs,,11756,665001,,$-0.00,,,,,,,,,,,,,,,,,,
Brailyn Marquez,SP,Cubs,,13640,666622,,$-0.00,,,,,,,,,,,,,,,,,,
Christopher Morel,SS,Cubs,,13401,666624,,$-0.00,,,,,,,,,,,,,,,,,,
Alexander Vizcaino,SP,Cubs,,13130,,,$-0.00,,,,,,,,,,,,,,,,,,
Tyler Ladendorf,2B,Cubs,,5663,502285,,$-0.00,1,1,,,,,,,,,,,,,,,,
Tyler Payne,C,Cubs,,12869,,,$-0.00,1,2,,,,,,,,,,,,,,,,
Tony Wolters,C,Cubs,,7421,547172,,$-0.00,14,24,3,,3,,,.125,,,,,,,,,,
Taylor Gushue,C,Cubs,,11958,656494,,$-0.00,2,4,,,,,,,,,,,,,,,,
Trent Giambrone,SS,Cubs,,12164,623508,,$-0.00,5,13,2,,,,,.154,,,,,,,,,,
Michael Rucker,RP,Cubs,,13048,621074,,$-0.00,19,1,,,,,,,20,28.33,32,30,11,22,,1,1.518,6.99
Jose Lobaton,C,Cubs,,560,446653,lobatjo01,$-0.00,6,11,,,1,,,,,,,,,,,,,
Greg Deichmann,RF,Cubs,,12615,656364,,$-0.00,14,30,4,,,1,,.133,,,,,,,,,,
Kyle Ryan,RP,Cubs,,7567,594986,,$-0.00,13,2,,,,,,,13,13.33,17,8,6,10,,1,1.725,6.75
P.J. Higgins,C,Cubs,,12562,,,$-0.00,9,23,1,,1,,,.043,,,,,,,,,,
Trevor Megill,RP,Cubs,,12088,656730,,$-0.00,27,,,,,,,,28,23.67,36,30,8,22,1,,1.859,8.37
Cory Abbott,SP,Cubs,,13595,,,$-0.00,8,3,1,,,,,.333,7,17.33,20,12,11,13,,,1.788,6.75
Ryan Meisinger,RP,Cubs,,12274,664682,,$-0.00,6,,,,,,,,7,7.33,11,6,5,10,,,2.182,12.27
Jake Jewell,SP,Cubs,,11887,657228,,$-0.00,10,1,,,,,,,10,10.00,18,10,5,11,,,2.300,9.90
Jake Arrieta,SP,Cubs,,371,453562,arrieja01,$-0.00,24,23,3,,3,,,.130,24,98.67,131,83,44,81,5,,1.774,7.39
