Player,Position,ProTeam,RotoTeam,RVid,MLBAMID,BDBID,RotoValue,bG,bAB,bH,b2B,b3B,bHR,bRBOE,bR,bRBI,bSB,bCS,bBB,bIBB,bHBP,bSF,bSH,bAvg,bOBP,bSlg,bwOBA,pG,pIP,pH,pHR,pK,pBB,pIBB,pHB,pER,pWin,pL,pSav,pWHIP,pERA,pFIP
Ryan Zimmerman,1B,Nationals,,2519,475582,zimmery01,$24.91,144,524,159,33,,36,3,90,108,1,,44,1,3,5,,.303,.358,.573,.399,,,,,,,,,,,,,,,
Tommy Pham,CF/LF,Cardinals,,3549,502054,,$22.88,128,444,136,22,2,23,7,95,73,25,7,71,,10,3,2,.306,.409,.520,.421,,,,,,,,,,,,,,,
Whit Merrifield,2B,Royals,,5926,593160,,$21.90,145,587,169,32,6,19,7,80,78,34,8,29,,6,7,1,.288,.324,.460,.356,,,,,,,,,,,,,,,
Cody Bellinger,1B/LF,Dodgers,,10872,641355,,$21.26,132,480,128,26,4,39,2,87,97,10,3,64,13,1,3,,.267,.352,.581,.391,,,,,,,,,,,,,,,
Domingo Santana,RF,Brewers,,6873,570267,,$19.20,151,525,146,29,,30,3,88,85,15,4,73,2,6,3,,.278,.371,.505,.385,,,,,,,,,,,,,,,
Andrew Benintendi,CF/LF,Red Sox,,11492,643217,,$16.06,151,573,155,26,1,20,2,84,90,20,5,70,7,6,8,1,.271,.351,.424,.344,,,,,,,,,,,,,,,
Justin Smoak,1B,Blue Jays,,4469,475253,smoakju01,$15.30,158,560,151,29,1,38,2,85,90,,1,73,3,2,2,,.270,.355,.529,.379,,,,,,,,,,,,,,,
Chris Taylor,2B/CF/LF/SS,Dodgers,,6789,621035,,$14.35,140,514,148,34,5,21,7,85,72,17,4,50,,3,1,,.288,.354,.496,.383,,,,,,,,,,,,,,,
Avisaíl García,DH/RF,White Sox,,1250,541645,garciav01,$14.27,136,518,171,27,5,18,7,75,80,5,3,33,5,9,1,,.330,.380,.506,.393,,,,,,,,,,,,,,,
Eddie Rosario,CF/LF,Twins,,6386,592696,,$14.11,151,542,157,33,2,27,2,79,78,9,8,35,1,,8,4,.290,.326,.507,.356,,,,,,,,,,,,,,,
Alex Bregman,3B/SS,Astros,,11366,608324,,$13.55,155,556,158,39,5,19,3,88,71,17,5,55,2,7,7,1,.284,.351,.475,.364,,,,,,,,,,,,,,,
Marwin Gonzalez,1B/2B/3B/LF/SS,Astros,,2731,503556,gonzama01,$13.05,134,455,138,34,,23,2,67,90,8,3,49,4,6,2,3,.303,.375,.530,.393,,,,,,,,,,,,,,,
Mike Moustakas,3B,Royals,,1398,519058,moustmi01,$12.75,148,555,151,24,,38,3,75,85,,,34,7,3,6,,.272,.314,.521,.355,,,,,,,,,,,,,,,
Shin-Soo Choo,DH/RF,Rangers,,1109,425783,choosh01,$11.59,149,544,142,20,1,22,5,96,78,12,3,77,1,7,5,3,.261,.355,.423,.354,,,,,,,,,,,,,,,
Josh Reddick,LF/RF,Astros,,170,502210,reddijo01,$10.42,134,477,150,34,4,13,6,77,82,7,3,43,1,,12,1,.314,.362,.484,.375,,,,,,,,,,,,,,,
Yasiel Puig,RF,Dodgers,,6130,624577,puigya01,$10.36,152,499,131,25,1,28,5,72,74,15,6,64,8,2,5,,.263,.346,.485,.363,,,,,,,,,,,,,,,
Mike Zunino,C,Mariners,,6238,572287,zuninmi01,$10.05,124,387,97,25,,25,1,52,64,1,,39,,8,1,,.251,.331,.509,.362,,,,,,,,,,,,,,,
Steven Souza Jr.,RF,Rays,,2518,519306,,$9.82,148,523,125,21,2,30,2,78,78,16,4,84,2,7,1,2,.239,.350,.459,.359,,,,,,,,,,,,,,,
Logan Morrison,1B,Rays,,1974,489149,morrilo01,$9.26,149,512,126,22,1,38,1,75,85,2,,81,8,5,3,,.246,.353,.516,.370,,,,,,,,,,,,,,,
Andrelton Simmons,SS,Angels,,5583,592743,simmoan01,$8.84,158,589,164,38,2,14,6,77,69,19,6,47,,3,8,,.278,.331,.421,.340,,,,,,,,,,,,,,,
Joey Gallo,1B/3B,Rangers,,6323,608336,,$8.81,145,449,94,18,3,41,5,85,80,7,2,75,1,8,,,.209,.333,.537,.378,,,,,,,,,,,,,,,
Zack Cozart,SS,Angels,,2842,446359,cozarza01,$7.23,122,438,130,24,7,24,5,80,63,3,,62,,3,4,,.297,.385,.548,.409,,,,,,,,,,,,,,,
Trey Mancini,1B/LF,Orioles,,9387,641820,,$7.03,147,543,159,26,4,24,4,65,78,1,,33,1,6,4,,.293,.338,.488,.362,,,,,,,,,,,,,,,
Josh Bell,1B,Pirates,,6324,605137,,$6.25,159,549,140,26,6,26,7,75,90,2,4,66,4,1,4,,.255,.334,.466,.352,,,,,,,,,,,,,,,
Yuli Gurriel,1B/3B,Astros,,11531,493329,,$6.21,139,529,158,43,1,18,6,69,75,3,2,22,1,7,6,,.299,.332,.486,.360,,,,,,,,,,,,,,,
Michael Conforto,CF/LF,Mets,,10693,624424,,$4.69,109,373,104,20,1,27,2,72,68,2,,57,5,8,2,,.279,.384,.555,.403,,,,,,,,,,,,,,,
David Peralta,LF/RF,Diamondbacks,,9450,444482,,$4.58,140,525,154,31,3,14,5,82,57,8,4,43,1,6,3,,.293,.352,.444,.356,,,,,,,,,,,,,,,
Byron Buxton,CF,Twins,,6314,621439,,$4.53,140,462,117,14,6,16,3,69,51,29,1,38,2,4,2,5,.253,.311,.413,.336,,,,,,,,,,,,,,,
Kurt Suzuki,C,Braves,,4816,435559,suzukku01,$4.42,81,276,78,13,,19,,38,50,,,17,2,13,2,1,.283,.350,.536,.377,,,,,,,,,,,,,,,
Justin Bour,1B,Marlins,,2645,571506,,$3.74,108,377,109,18,,25,3,52,83,1,,47,7,1,4,,.289,.366,.536,.388,,,,,,,,,,,,,,,
Yonder Alonso,1B,Indians,,2819,475174,alonsyo01,$3.62,142,451,120,22,,28,1,72,67,2,,68,6,2,,,.266,.365,.501,.374,,,,,,,,,,,,,,,
Ryon Healy,1B/3B/DH,Mariners,,10898,592387,,$3.59,149,576,156,29,,25,8,66,78,,1,23,,4,2,,.271,.302,.451,.337,,,,,,,,,,,,,,,
José Reyes,2B/3B/SS,Mets,,2168,408314,reyesjo01,$3.15,145,501,123,25,7,15,3,75,58,24,6,50,1,2,3,5,.246,.312,.413,.328,,,,,,,,,,,,,,,
Tim Beckham,SS,Orioles,,587,542921,beckhti01,$2.53,137,533,147,18,5,22,5,67,62,6,5,36,,4,1,1,.276,.325,.452,.345,,,,,,,,,,,,,,,
Tyler Flowers,C,Braves,,4971,452095,flowety01,$1.77,99,317,89,16,,12,5,41,49,,1,31,1,20,2,,.281,.378,.445,.374,,,,,,,,,,,,,,,
Jed Lowrie,2B,Athletics,,145,476704,lowrije01,$1.74,153,567,157,49,3,14,3,86,69,,1,73,2,2,3,,.277,.360,.448,.357,,,,,,,,,,,,,,,
Robinson Chirinos,C,Rangers,,2632,455139,chiriro01,$1.20,88,263,68,14,1,17,1,46,39,1,,34,,10,1,1,.259,.362,.513,.381,,,,,,,,,,,,,,,
Matt Joyce,LF/RF,Athletics,,623,459964,joycema01,$1.16,141,469,114,33,,25,,78,68,4,1,66,,2,7,,.243,.335,.473,.349,,,,,,,,,,,,,,,
Ian Happ,2B/CF/LF,Cubs,,11673,664023,,$1.00,115,364,92,17,3,24,3,62,68,8,4,39,5,4,4,2,.253,.327,.514,.361,,,,,,,,,,,,,,,
Joe Mauer,1B/DH,Twins,,1521,408045,mauerjo01,$1.00,141,525,160,36,1,7,7,69,71,2,1,66,3,3,3,,.305,.384,.417,.366,,,,,,,,,,,,,,,
Tim Anderson,SS,White Sox,,10574,641313,,$1.00,146,587,151,26,4,17,8,72,56,15,1,13,,3,1,2,.257,.276,.402,.312,,,,,,,,,,,,,,,
Chase Headley,1B/3B,Padres,,3979,452104,headlch01,$1.00,147,512,140,30,1,12,10,77,61,9,2,60,2,6,7,1,.273,.352,.406,.352,,,,,,,,,,,,,,,
Paul DeJong,2B/3B/SS,Cardinals,,11418,657557,,$1.00,108,417,119,26,1,25,2,55,65,1,,21,1,4,1,,.285,.325,.532,.369,,,,,,,,,,,,,,,
Michael A. Taylor,CF,Nationals,,5662,572191,,$1.00,118,399,108,23,3,19,2,55,53,17,7,29,3,1,2,1,.271,.319,.486,.350,,,,,,,,,,,,,,,
Mitch Moreland,1B,Red Sox,,4519,519048,morelmi01,$1.00,149,508,125,34,,22,5,73,79,,1,57,6,6,5,,.246,.326,.443,.338,,,,,,,,,,,,,,,
Jorge Polanco,SS,Twins,,6049,593871,,$1.00,133,488,125,30,3,13,6,60,74,13,5,41,1,2,6,7,.256,.309,.410,.326,,,,,,,,,,,,,,,
Eduardo Escobar,3B/DH/SS,Twins,,917,500871,escobed01,$1.00,129,457,116,16,5,21,3,62,73,5,1,33,3,5,3,1,.254,.309,.449,.332,,,,,,,,,,,,,,,
Scott Schebler,RF,Reds,,6564,594988,,$1.00,141,473,110,25,2,30,2,63,67,5,3,39,5,14,5,,.233,.307,.484,.337,,,,,,,,,,,,,,,
Gerardo Parra,LF/RF,Rockies,,3692,467827,parrage01,$1.00,115,392,121,24,1,10,1,56,71,2,5,20,,4,9,,.309,.341,.452,.340,,,,,,,,,,,,,,,
Aaron Altherr,LF/RF,Phillies,,7372,571437,,$1.00,107,372,101,24,5,19,4,58,65,5,4,32,2,7,1,,.272,.340,.516,.372,,,,,,,,,,,,,,,
Keon Broxton,CF,Brewers,,3680,542979,,$1.00,143,414,91,15,4,20,4,66,49,21,7,40,1,7,1,1,.220,.298,.420,.324,,,,,,,,,,,,,,,
Delino DeShields,CF/LF,Rangers,,5302,592261,,$1.00,120,376,101,15,2,6,5,75,22,29,8,44,,3,4,13,.269,.336,.367,.339,,,,,,,,,,,,,,,
Kevin Pillar,CF,Blue Jays,,6552,607680,pillake01,$1.00,154,587,150,37,1,16,6,72,42,15,6,33,,6,3,3,.256,.299,.404,.317,,,,,,,,,,,,,,,
Travis d'Arnaud,C,Mets,,723,518595,darnatr01,$1.00,112,348,85,19,1,16,4,39,57,,,23,3,2,3,,.244,.293,.443,.323,,,,,,,,,,,,,,,
Alex Avila,C,Cubs,,1191,488671,avilaal01,$1.00,112,311,82,13,1,14,,41,49,,1,62,2,1,1,1,.264,.386,.447,.366,,,,,,,,,,,,,,,
Manny Piña,C,Brewers,,1373,444489,pinama01,$1.00,107,330,92,21,,9,1,45,43,2,,20,,5,3,1,.279,.326,.424,.332,,,,,,,,,,,,,,,
Christian Vázquez,C,Red Sox,,5299,543877,,$1.00,99,324,94,18,2,5,1,43,32,7,2,17,,3,1,,.290,.330,.404,.329,,,,,,,,,,,,,,,
Chris Iannetta,C,Rockies,,3783,455104,iannech01,$1.00,89,272,69,19,,17,1,38,43,,,37,,6,1,,.254,.354,.511,.375,,,,,,,,,,,,,,,
James McCann,C,Tigers,,5596,543510,,$1.00,106,352,89,14,2,13,6,39,49,1,,26,,9,3,1,.253,.317,.415,.336,,,,,,,,,,,,,,,
Yan Gomes,C,Indians,,5592,543228,gomesya01,$1.00,105,341,79,15,,14,3,43,56,,,31,,8,2,1,.232,.308,.399,.319,,,,,,,,,,,,,,,
Austin Hedges,C,Padres,,6232,595978,,$1.00,120,386,83,17,,18,1,36,55,4,1,23,3,3,3,2,.215,.261,.399,.286,,,,,,,,,,,,,,,
Austin Barnes,2B/C,Dodgers,,6547,605131,,$1.00,102,218,63,15,2,8,1,35,38,4,1,39,1,5,,,.289,.408,.486,.397,,,,,,,,,,,,,,,
Jason Castro,C,Twins,,2953,488771,castrja01,$1.00,110,356,86,22,,10,2,49,47,,,45,1,4,1,1,.242,.332,.388,.325,,,,,,,,,,,,,,,
Joe Panik,2B,Giants,,5635,605412,,$0.00,138,511,147,28,5,10,3,60,53,4,1,46,4,5,8,3,.288,.346,.421,.340,,,,,,,,,,,,,,,
Kolten Wong,2B,Cardinals,,5622,543939,wongko01,$0.00,108,354,101,27,3,4,,55,42,8,2,41,11,12,3,1,.285,.375,.412,.344,,,,,,,,,,,,,,,
Kevin Kiermaier,CF,Rays,,5374,595281,kiermke01,$-1.02,98,380,105,15,3,15,2,56,39,16,7,31,2,5,1,4,.276,.335,.450,.348,,,,,,,,,,,,,,,
Max Kepler,RF,Twins,,6050,596146,,$-1.09,147,511,124,32,2,19,5,67,69,6,1,47,2,6,3,1,.243,.312,.425,.330,,,,,,,,,,,,,,,
Tucker Barnhart,C,Reds,,5256,571466,,$-1.38,121,370,100,24,2,7,2,26,44,4,,42,11,3,3,5,.270,.343,.403,.329,,,,,,,,,,,,,,,
Ben Gamel,LF/RF,Mariners,,5946,592325,,$-2.20,134,509,140,27,5,11,7,68,59,4,1,36,1,1,3,1,.275,.322,.413,.334,,,,,,,,,,,,,,,
Carlos Gómez,CF/LF,Rangers,,3164,460576,gomezca01,$-2.51,105,368,94,23,1,17,2,51,51,13,5,31,,19,5,3,.255,.338,.462,.354,,,,,,,,,,,,,,,
Yolmer Sánchez,2B/3B,White Sox,,5800,570560,,$-2.53,141,484,129,19,8,12,8,63,59,8,9,35,2,4,4,7,.267,.315,.413,.328,,,,,,,,,,,,,,,
Chase Utley,2B,Dodgers,,2329,400284,utleych01,$-2.65,127,309,73,20,4,8,1,43,34,6,1,32,,9,2,1,.236,.323,.405,.326,,,,,,,,,,,,,,,
Michael Brantley,LF,Indians,,1094,488726,brantmi02,$-2.92,90,338,101,20,1,9,4,47,52,11,1,31,3,2,4,,.299,.357,.444,.364,,,,,,,,,,,,,,,
Kyle Schwarber,LF,Cubs,,10616,656941,,$-3.24,129,422,89,16,1,30,2,67,59,1,1,59,1,5,,,.211,.315,.467,.340,,,,,,,,,,,,,,,
Manuel Margot,CF,Padres,,10226,622534,,$-3.54,126,487,128,18,7,13,6,53,39,17,7,35,,2,4,1,.263,.312,.409,.327,,,,,,,,,,,,,,,
Martín Maldonado,C,Angels,,3122,455117,maldoma01,$-4.30,138,429,95,19,1,14,2,43,38,,2,15,1,18,1,8,.221,.272,.368,.285,,,,,,,,,,,,,,,
Cameron Rupp,C,Phillies,,6513,519237,ruppca01,$-5.06,88,295,64,17,,14,4,35,34,1,,34,3,1,1,,.217,.299,.417,.321,,,,,,,,,,,,,,,
Matt Adams,1B,Nationals,,5355,571431,adamsma01,$-5.28,131,339,93,22,1,20,,46,65,,,23,5,1,4,,.274,.319,.522,.352,,,,,,,,,,,,,,,
Hunter Renfroe,RF,Padres,,10146,592669,,$-5.84,122,445,103,25,1,26,5,51,58,3,,27,1,6,1,,.231,.284,.467,.331,,,,,,,,,,,,,,,
René Rivera,C,Cubs,,2119,425784,riverre01,$-5.99,74,218,55,9,,10,,23,35,,1,14,3,3,1,1,.252,.304,.431,.313,,,,,,,,,,,,,,,
Caleb Joseph,C,Orioles,,422,543376,,$-6.53,89,254,65,14,1,8,2,31,28,,,10,,1,,1,.256,.286,.413,.311,,,,,,,,,,,,,,,
Nick Hundley,C,Giants,,3944,460026,hundlni01,$-6.57,101,287,70,23,,9,6,27,35,,,12,2,,2,2,.244,.271,.418,.312,,,,,,,,,,,,,,,
Mitch Haniger,CF/RF,Mariners,,6881,571745,,$-6.57,96,369,104,25,2,16,3,58,47,5,4,31,,9,,1,.282,.351,.491,.370,,,,,,,,,,,,,,,
Aaron Hicks,CF/LF/RF,Yankees,,5349,543305,hicksaa01,$-6.60,88,301,80,18,,15,,54,52,10,5,51,,3,5,1,.266,.371,.475,.368,,,,,,,,,,,,,,,
Tommy Joseph,1B,Phillies,,5063,571830,,$-6.68,142,495,119,27,1,22,3,51,69,1,,33,1,2,3,,.240,.289,.432,.316,,,,,,,,,,,,,,,
Kevan Smith,C,White Sox,,6217,607345,,$-7.18,87,276,78,17,,4,2,23,30,,,9,,3,3,2,.283,.307,.388,.312,,,,,,,,,,,,,,,
Sandy León,C,Red Sox,,5609,506702,leonsa01,$-7.23,85,271,61,14,,7,1,32,39,,,25,1,1,3,1,.225,.289,.354,.287,,,,,,,,,,,,,,,
Cory Spangenberg,2B/3B/LF,Padres,,6471,605486,,$-7.68,129,444,117,18,2,13,2,57,46,11,3,34,1,5,1,2,.264,.321,.401,.325,,,,,,,,,,,,,,,
Francisco Cervelli,C,Pirates,,269,465041,cervefr01,$-7.87,81,265,66,13,2,5,3,31,31,,2,32,,6,1,,.249,.342,.370,.326,,,,,,,,,,,,,,,
Jesus Súcre,C,Rays,,1831,491696,sucreje01,$-7.98,62,176,45,6,,7,,20,29,2,,7,,3,4,2,.256,.286,.409,.304,,,,,,,,,,,,,,,
Nick Williams,LF/RF,Phillies,,10019,608384,,$-8.13,83,313,90,14,4,12,3,45,55,1,2,20,,6,4,,.288,.338,.473,.356,,,,,,,,,,,,,,,
Yoán Moncada,2B,White Sox,,10895,660162,,$-8.27,54,199,46,8,2,8,,31,22,3,2,29,,3,,,.231,.338,.412,.331,,,,,,,,,,,,,,,
Jon Jay,CF/LF,Cubs,,3531,445055,jayjo02,$-8.31,141,379,112,18,3,2,4,65,34,6,2,37,3,12,2,3,.296,.372,.375,.346,,,,,,,,,,,,,,,
Lucas Duda,1B/DH,Rays,,4970,446263,dudalu01,$-8.44,127,423,92,28,,30,,50,64,,,60,6,6,2,,.217,.322,.496,.346,,,,,,,,,,,,,,,
Matt Davidson,3B/DH,White Sox,,5310,571602,davidma02,$-8.55,118,414,91,16,1,26,,43,68,,1,19,,5,5,,.220,.260,.452,.300,,,,,,,,,,,,,,,
Howie Kendrick,2B/LF,Nationals,,1679,435062,kendrho01,$-8.63,91,305,96,16,3,9,3,40,41,12,5,22,,5,2,,.315,.368,.475,.378,,,,,,,,,,,,,,,
Jarrod Dyson,CF/LF/RF,Mariners,,1417,502481,dysonja01,$-8.64,111,346,87,13,3,5,2,56,30,28,7,28,2,10,2,4,.251,.321,.350,.315,,,,,,,,,,,,,,,
José Martínez,1B/LF,Cardinals,,953,500874,,$-8.65,106,272,84,13,1,14,3,47,46,4,,32,2,,2,1,.309,.378,.518,.398,,,,,,,,,,,,,,,
Devon Travis,2B,Blue Jays,,6784,581527,,$-8.75,50,185,48,18,,5,,22,24,4,2,7,,2,2,1,.259,.289,.438,.313,,,,,,,,,,,,,,,
Jake Marisnick,CF/LF,Astros,,5210,545350,marisja01,$-8.89,106,230,56,10,,16,1,50,35,9,4,20,1,6,1,2,.243,.317,.496,.352,,,,,,,,,,,,,,,
Adam Frazier,2B/LF,Pirates,,10158,624428,,$-9.18,121,406,112,20,6,6,5,55,53,9,5,36,2,8,3,1,.276,.344,.399,.338,,,,,,,,,,,,,,,
Jason Heyward,CF/RF,Cubs,,1885,518792,heywaja01,$-9.28,126,432,112,15,4,11,5,59,59,4,4,41,1,3,2,2,.259,.325,.389,.324,,,,,,,,,,,,,,,
Carlos Asuaje,2B,Padres,,10763,641319,,$-9.33,89,307,83,14,1,4,1,28,21,,1,28,,2,1,5,.270,.329,.362,.314,,,,,,,,,,,,,,,
Adam Lind,1B/LF,Nationals,,800,452252,lindad01,$-9.45,116,267,81,14,,14,2,39,59,1,,28,5,,6,,.303,.362,.513,.376,,,,,,,,,,,,,,,
Jordy Mercer,SS,Pirates,,3345,474568,mercejo03,$-9.48,145,502,128,24,5,14,5,52,58,,4,51,13,3,2,,.255,.326,.406,.319,,,,,,,,,,,,,,,
Roberto Pérez,C,Indians,,1044,547379,,$-9.56,73,217,45,12,,8,,22,38,,1,26,,,1,4,.207,.286,.373,.292,,,,,,,,,,,,,,,
José Peraza,2B/OF/SS,Reds,,6000,606299,,$-9.82,143,487,126,9,4,5,5,50,37,23,8,20,1,7,1,3,.259,.295,.324,.290,,,,,,,,,,,,,,,
José Iglesias,SS,Tigers,,144,578428,iglesjo01,$-9.98,130,463,118,33,1,6,2,56,54,7,4,21,,1,1,3,.255,.286,.369,.292,,,,,,,,,,,,,,,
Bradley Zimmer,CF,Indians,,10831,605548,,$-10.02,101,299,72,15,2,8,4,41,39,18,1,26,1,4,3,,.241,.307,.385,.327,,,,,,,,,,,,,,,
Austin Jackson,CF/LF,Indians,,1253,457706,jacksau01,$-10.05,85,280,89,19,3,7,2,46,35,3,1,33,,1,4,,.318,.387,.482,.385,,,,,,,,,,,,,,,
Jorge Bonifacio,RF,Royals,,7396,593528,,$-10.24,113,384,98,15,1,17,,55,40,1,1,35,,2,1,,.255,.320,.432,.328,,,,,,,,,,,,,,,
Wilmer Flores,1B/3B,Mets,,2165,527038,florewi01,$-10.56,110,336,91,17,1,18,2,42,52,1,1,17,1,3,6,,.271,.307,.488,.341,,,,,,,,,,,,,,,
Derek Dietrich,2B/3B,Marlins,,6087,518618,dietrde01,$-10.67,135,406,101,22,5,13,3,56,53,,1,36,5,18,4,,.249,.334,.424,.333,,,,,,,,,,,,,,,
Lonnie Chisenhall,RF,Indians,,1070,502082,chiselo01,$-10.89,82,236,68,17,1,12,1,34,53,2,2,25,2,3,3,3,.288,.356,.521,.376,,,,,,,,,,,,,,,
Matt Holliday,DH/LF,Yankees,,3530,407812,hollima01,$-11.14,105,373,86,18,,19,6,50,64,1,,46,,3,5,,.231,.316,.432,.339,,,,,,,,,,,,,,,
Albert Almora Jr.,CF,Cubs,,6315,546991,,$-11.17,132,299,89,18,1,8,3,39,46,1,,19,1,,2,3,.298,.334,.445,.349,,,,,,,,,,,,,,,
Chris Herrmann,C/LF,Diamondbacks,,5086,543302,herrmch01,$-11.26,106,226,41,7,,10,1,35,27,5,,29,,,1,,.181,.273,.345,.284,,,,,,,,,,,,,,,
Derek Norris,C,Rays,,2481,519083,norride01,$-11.43,53,179,36,5,,9,1,21,24,1,,12,,3,4,,.201,.258,.380,.281,,,,,,,,,,,,,,,
John Hicks,1B/C,Tigers,,5729,543308,,$-11.43,60,173,46,12,,6,,25,22,2,1,13,,3,1,,.266,.326,.439,.334,,,,,,,,,,,,,,,
Chris Gimenez,C,Twins,,1053,460269,gimench01,$-11.57,74,186,41,9,,7,,28,16,1,,33,,4,,2,.220,.347,.382,.331,,,,,,,,,,,,,,,
Nori Aoki,LF/RF,Mets,,5569,493114,aokino01,$-11.68,109,336,93,20,2,5,2,48,35,10,2,29,1,3,5,1,.277,.334,.393,.330,,,,,,,,,,,,,,,
Héctor Sánchez,C,Padres,,4109,516949,sanchhe01,$-11.94,75,137,30,4,,8,,14,25,,,5,1,,1,,.219,.245,.423,.282,,,,,,,,,,,,,,,
Omar Narváez,C,White Sox,,11107,553882,,$-11.96,90,253,70,10,,2,1,23,14,,,38,1,1,,3,.277,.369,.340,.331,,,,,,,,,,,,,,,
Jesús Aguilar,1B,Brewers,,6259,542583,,$-11.97,133,279,74,15,2,16,2,40,52,,,25,1,4,3,,.265,.331,.505,.362,,,,,,,,,,,,,,,
Mikie Mahtook,CF/LF/RF,Tigers,,6900,543484,,$-12.12,109,348,96,15,6,12,7,50,38,6,,23,,6,2,,.276,.330,.457,.362,,,,,,,,,,,,,,,
Jorge Alfaro,C,Phillies,,6742,595751,,$-12.18,29,107,34,6,,5,2,12,14,,,3,1,4,,,.318,.360,.514,.391,,,,,,,,,,,,,,,
Andrew Knapp,C,Phillies,,11137,595284,,$-12.20,56,171,44,8,1,3,1,26,13,1,,31,4,,2,,.257,.368,.368,.332,,,,,,,,,,,,,,,
Leury García,CF/LF,White Sox,,4485,544725,garcile02,$-12.47,87,300,81,15,2,9,1,41,33,8,5,13,,8,2,3,.270,.313,.423,.324,,,,,,,,,,,,,,,
Miguel Montero,C,Blue Jays,,3636,471083,montemi01,$-13.04,76,185,40,6,,6,1,24,16,1,,23,1,3,2,,.216,.310,.346,.299,,,,,,,,,,,,,,,
Matt Olson,1B/RF,Athletics,,9384,621566,,$-13.11,59,189,49,2,,24,,33,45,,,22,1,5,,,.259,.352,.651,.416,,,,,,,,,,,,,,,
Bruce Maxwell,C,Athletics,,7444,622194,,$-13.19,76,219,52,12,,3,,21,22,,,31,,,2,1,.237,.328,.333,.302,,,,,,,,,,,,,,,
Rhys Hoskins,1B/LF,Phillies,,11705,656555,,$-13.58,50,170,44,7,,18,2,37,48,2,,37,1,3,2,,.259,.396,.618,.433,,,,,,,,,,,,,,,
Jose Pirela,LF/SS,Padres,,348,517369,,$-13.82,83,312,90,25,4,10,3,43,40,4,3,27,,2,2,1,.288,.346,.490,.367,,,,,,,,,,,,,,,
Seth Smith,LF/RF,Orioles,,3845,452234,smithse01,$-13.88,111,330,85,19,,13,2,50,32,2,,36,3,6,1,,.258,.340,.433,.343,,,,,,,,,,,,,,,
Tony Wolters,C,Rockies,,7421,547172,,$-13.88,83,229,55,8,1,,1,30,16,,1,33,9,2,,2,.240,.338,.284,.281,,,,,,,,,,,,,,,
Devin Mesoraco,C,Reds,,2815,519023,mesorde01,$-14.37,56,141,30,5,1,6,,17,14,1,,18,,5,1,,.213,.321,.390,.318,,,,,,,,,,,,,,,
Luis Valbuena,1B/3B,Angels,,1067,472528,valbulu01,$-14.43,117,347,69,15,,22,,42,65,,2,48,1,1,5,,.199,.294,.432,.310,,,,,,,,,,,,,,,
Robbie Grossman,DH/LF/RF,Twins,,3351,543257,grossro01,$-14.47,119,382,94,22,1,9,1,62,45,3,1,67,,3,2,2,.246,.360,.380,.337,,,,,,,,,,,,,,,
Jett Bandy,C,Brewers,,5645,542908,,$-14.85,60,169,35,6,,6,1,14,18,1,,15,,4,,,.207,.287,.349,.291,,,,,,,,,,,,,,,
Max Moroff,2B,Pirates,,10954,621559,,$-14.89,56,120,24,4,1,3,1,19,21,,1,16,,2,1,1,.200,.300,.325,.288,,,,,,,,,,,,,,,
David Freese,1B/3B,Pirates,,3514,501896,freesda01,$-14.95,130,426,112,16,,10,3,44,52,,1,58,5,15,4,,.263,.368,.371,.336,,,,,,,,,,,,,,,
A.J. Ellis,C,Marlins,,4622,454560,ellisaj01,$-14.97,51,143,30,5,,6,1,17,14,,,12,,6,,2,.210,.294,.371,.303,,,,,,,,,,,,,,,
Kevin Plawecki,C,Mets,,6410,608700,,$-15.00,37,100,26,5,,3,2,11,13,1,,14,2,3,1,,.260,.364,.400,.353,,,,,,,,,,,,,,,
Ezequiel Carrera,LF/RF,Blue Jays,,4331,485567,carreez01,$-15.08,131,287,81,10,1,8,1,38,20,10,1,30,,3,,5,.282,.351,.408,.350,,,,,,,,,,,,,,,
Dansby Swanson,SS,Braves,,11537,621020,,$-15.40,144,488,113,23,2,6,6,59,51,3,3,59,10,,4,,.232,.312,.324,.290,,,,,,,,,,,,,,,
Elias Díaz,C,Pirates,,10218,553869,,$-15.47,64,188,42,14,,1,,18,19,1,,11,,,1,,.223,.265,.314,.259,,,,,,,,,,,,,,,
Drew Butera,C,Royals,,1511,460077,buterdr01,$-15.55,75,163,37,4,1,3,1,18,14,,,12,,1,,1,.227,.282,.319,.277,,,,,,,,,,,,,,,
Austin Romine,C,Yankees,,281,519222,rominau01,$-15.69,80,229,50,9,1,2,5,19,21,,,16,,2,3,2,.218,.270,.293,.273,,,,,,,,,,,,,,,
Ryan Hanigan,C,Rockies,,2811,452672,hanigry01,$-16.05,33,101,27,2,,2,,9,13,,,8,2,1,1,1,.267,.321,.347,.294,,,,,,,,,,,,,,,
Raffy Lopez,C,Blue Jays,,6299,607257,,$-16.25,24,54,12,1,,4,,9,12,,,7,,,1,,.222,.306,.463,.330,,,,,,,,,,,,,,,
Stephen Drew,2B,Nationals,,3668,452220,drewst01,$-16.50,46,95,24,7,,1,1,9,17,,,8,,,3,,.253,.302,.358,.299,,,,,,,,,,,,,,,
Carlos Ruiz,C,Mariners,,2310,434563,ruizca01,$-16.55,53,125,27,8,,3,1,14,11,1,,14,,4,1,1,.216,.310,.352,.307,,,,,,,,,,,,,,,
Rafael Devers,3B,Red Sox,,11482,646240,,$-16.58,58,222,63,14,,10,2,34,30,3,1,18,3,,,,.284,.338,.482,.359,,,,,,,,,,,,,,,
Daniel Descalso,2B/LF/SS,Diamondbacks,,3506,518614,descada01,$-16.60,130,344,80,16,5,10,1,47,51,4,,48,,4,2,,.233,.332,.395,.328,,,,,,,,,,,,,,,
Yunel Escobar,3B,Angels,,1854,488862,escobyu01,$-16.90,89,350,96,20,1,7,3,43,31,1,4,29,,2,,,.274,.333,.397,.327,,,,,,,,,,,,,,,
Ben Revere,CF/LF/RF,Angels,,1559,519184,reverbe01,$-16.98,109,291,80,13,2,1,6,37,20,21,6,15,,,2,,.275,.308,.344,.316,,,,,,,,,,,,,,,
Alex Gordon,LF,Royals,,1395,460086,gordoal01,$-17.04,148,476,99,20,2,9,4,52,45,7,4,45,3,14,4,2,.208,.292,.315,.280,,,,,,,,,,,,,,,
Matt Chapman,3B,Athletics,,11357,656305,,$-17.09,84,290,68,23,2,14,2,39,40,,3,32,,2,2,,.234,.313,.472,.338,,,,,,,,,,,,,,,
Ryan Goins,2B/SS,Blue Jays,,762,572365,goinsry01,$-17.26,143,418,99,21,1,9,4,37,62,3,2,31,,,5,5,.237,.283,.356,.291,,,,,,,,,,,,,,,
Ronald Torreyes,2B/3B/SS,Yankees,,5262,591720,,$-17.52,108,315,92,15,1,3,4,35,36,2,,11,,1,4,5,.292,.310,.375,.316,,,,,,,,,,,,,,,
Brett Nicholas,C,Rangers,,5784,592592,,$-17.53,21,63,15,4,,2,,7,11,,,2,,,,,.238,.262,.397,.285,,,,,,,,,,,,,,,
Brian Goodwin,CF/LF/RF,Nationals,,6504,571718,,$-17.53,74,251,63,21,1,13,3,41,30,6,,23,2,1,3,,.251,.313,.498,.357,,,,,,,,,,,,,,,
Mallex Smith,CF/LF,Rays,,6895,605480,,$-18.06,81,256,69,8,4,2,5,33,12,16,5,23,,,1,2,.270,.326,.355,.329,,,,,,,,,,,,,,,
Jeff Mathis,C,Diamondbacks,,1664,425772,mathije01,$-18.07,60,186,40,10,2,2,,13,11,1,,14,1,2,,1,.215,.276,.323,.268,,,,,,,,,,,,,,,
Wilmer Difo,2B/SS,Nationals,,10495,594694,,$-18.10,124,332,90,10,4,5,4,47,21,10,1,24,6,1,3,5,.271,.315,.370,.316,,,,,,,,,,,,,,,
Adeiny Hechavarría,SS,Rays,,4952,588751,hechaad01,$-18.19,97,330,86,14,5,8,3,37,30,4,1,13,1,1,2,2,.261,.287,.406,.310,,,,,,,,,,,,,,,
Josh Phegley,C,Athletics,,883,572033,phegljo01,$-18.21,57,149,30,11,,3,1,14,10,,1,9,,2,1,,.201,.255,.336,.262,,,,,,,,,,,,,,,
Chad Pinder,DH/RF/SS,Athletics,,10889,640461,,$-18.23,87,282,67,15,1,15,5,36,42,2,1,18,,5,3,,.238,.292,.457,.336,,,,,,,,,,,,,,,
Geovany Soto,C,White Sox,,2643,434567,sotoge01,$-18.36,13,42,8,,,3,,5,9,,,4,,1,1,,.190,.271,.405,.292,,,,,,,,,,,,,,,
Rob Brantly,C,White Sox,,5093,542963,brantro01,$-18.60,13,31,9,1,,2,,4,5,,,3,,2,,,.290,.389,.516,.393,,,,,,,,,,,,,,,
Chance Sisco,C,Orioles,,11250,642082,,$-18.88,10,18,6,2,,2,,3,4,,,3,,1,,,.333,.455,.778,.505,,,,,,,,,,,,,,,
Francisco Peña,C,Orioles,,2117,506747,,$-18.94,5,10,5,,,2,,3,2,,,,,,,,.500,.500,1.100,.670,,,,,,,,,,,,,,,
Ozzie Albies,2B/SS,Braves,,11728,645277,,$-19.10,57,217,62,9,5,6,,34,28,8,1,21,,3,2,1,.286,.352,.456,.359,,,,,,,,,,,,,,,
Taylor Featherston,2B,Rays,,9543,605227,,$-19.20,17,39,7,1,,2,1,6,6,1,,5,,1,2,,.179,.277,.359,.302,,,,,,,,,,,,,,,
Juan Centeno,C,Rangers,,5409,518542,centeju01,$-19.38,22,52,12,,,2,,5,4,,,4,1,,,1,.231,.281,.346,.275,,,,,,,,,,,,,,,
Steve Pearce,1B/LF,Blue Jays,,3304,456665,pearcst01,$-19.38,92,313,79,17,1,13,4,38,37,,,27,1,5,3,,.252,.319,.438,.338,,,,,,,,,,,,,,,
Jose Lobaton,C,Nationals,,560,446653,lobatjo01,$-19.38,51,141,24,3,,4,2,11,11,,,14,1,1,1,1,.170,.247,.277,.248,,,,,,,,,,,,,,,
Adalberto Mondesi,2B,Royals,,7458,609275,,$-19.39,25,53,9,1,,1,1,4,3,5,2,3,,,,4,.170,.200,.245,.229,,,,,,,,,,,,,,,
Gift Ngoepe,2B,Blue Jays,,3346,547912,,$-19.42,28,54,12,2,1,,1,10,6,,,8,,,,1,.222,.317,.296,.302,,,,,,,,,,,,,,,
Dustin Garneau,C,Athletics,,7129,572863,,$-19.46,41,112,21,8,,2,1,10,9,,,12,,1,,1,.188,.270,.312,.271,,,,,,,,,,,,,,,
Arismendy Alcántara,2B,Reds,,6865,570489,,$-19.57,70,105,18,3,1,1,,13,7,2,,2,,,,1,.171,.185,.248,.196,,,,,,,,,,,,,,,
Max Stassi,C,Astros,,4815,545358,stassma01,$-19.62,14,24,4,1,,2,,5,4,,,6,,,1,,.167,.323,.458,.334,,,,,,,,,,,,,,,
Tim Federowicz,C,Giants,,97,543148,federti01,$-19.62,13,13,3,,,2,,3,3,,,1,,,,,.231,.286,.692,.400,,,,,,,,,,,,,,,
Victor Caratini,C,Cubs,,10250,605170,,$-19.66,31,59,15,3,,1,1,6,2,,,4,1,3,,,.254,.333,.356,.319,,,,,,,,,,,,,,,
Joey Wendle,2B,Rays,,6992,621563,,$-19.70,8,13,4,1,,1,,3,5,,,1,1,,,,.308,.357,.615,.388,,,,,,,,,,,,,,,
Cam Gallagher,C,Royals,,10584,595956,,$-19.82,13,24,6,1,,1,1,2,5,,,3,,,,,.250,.333,.417,.365,,,,,,,,,,,,,,,
Marco Hernández,2B,Red Sox,,10013,593523,,$-19.87,21,58,16,3,,,,7,2,,1,1,,1,,,.276,.300,.328,.273,,,,,,,,,,,,,,,
Kennys Vargas,1B/DH,Twins,,6989,573627,,$-19.89,78,241,61,13,,11,3,33,41,,,20,1,2,1,,.253,.314,.444,.338,,,,,,,,,,,,,,,
Erick Aybar,SS,Padres,,1692,430947,aybarer01,$-19.92,108,333,78,15,1,7,4,37,22,11,4,28,2,4,2,3,.234,.297,.348,.299,,,,,,,,,,,,,,,
Curt Casali,C,Rays,,5505,592200,,$-19.94,9,9,3,,,1,,2,3,,,3,,,1,,.333,.462,.667,.454,,,,,,,,,,,,,,,